ant-notifications mailing list archives

Site index · List index
Message view « Date » · « Thread »
Top « Date » · « Thread »
From Apache Jenkins Server <jenk...@builds.apache.org>
Subject Build failed in Jenkins: AntLib-antunit #54
Date Mon, 17 Dec 2018 17:43:30 GMT
See <https://builds.apache.org/job/AntLib-antunit/54/display/redirect>

------------------------------------------
Started by upstream project "AntLib-common" build number 22
originally caused by:
 Started by an SCM change
[EnvInject] - Loading node environment variables.
Building remotely on H28 (ubuntu xenial) in workspace <https://builds.apache.org/job/AntLib-antunit/ws/>
 > git rev-parse --is-inside-work-tree # timeout=10
Fetching changes from the remote Git repository
 > git config remote.origin.url https://gitbox.apache.org/repos/asf/ant-antlibs-antunit.git
# timeout=10
Fetching upstream changes from https://gitbox.apache.org/repos/asf/ant-antlibs-antunit.git
 > git --version # timeout=10
 > git fetch --tags --progress https://gitbox.apache.org/repos/asf/ant-antlibs-antunit.git
+refs/heads/*:refs/remotes/origin/*
 > git rev-parse refs/remotes/origin/master^{commit} # timeout=10
 > git rev-parse refs/remotes/origin/origin/master^{commit} # timeout=10
Checking out Revision cac02039dc3f06abd550ba5bacec5f5212b033eb (refs/remotes/origin/master)
 > git config core.sparsecheckout # timeout=10
 > git checkout -f cac02039dc3f06abd550ba5bacec5f5212b033eb
Commit message: "moved to gitbox"
 > git rev-list --no-walk cac02039dc3f06abd550ba5bacec5f5212b033eb # timeout=10
 > git remote # timeout=10
 > git submodule init # timeout=10
 > git submodule sync # timeout=10
 > git config --get remote.origin.url # timeout=10
 > git submodule init # timeout=10
 > git config -f .gitmodules --get-regexp ^submodule\.(.+)\.url # timeout=10
 > git config --get submodule.common.url # timeout=10
 > git config -f .gitmodules --get submodule.common.path # timeout=10
 > git submodule update --init --recursive common
[AntLib-antunit] $ /home/jenkins/tools/ant/apache-ant-1.9.9/bin/ant -file prepare.xml bootstrap
Buildfile: <https://builds.apache.org/job/AntLib-antunit/ws/prepare.xml>

update-prepare-script:
     [echo] updating prepare.xml

bootstrap:
     [echo] Bootstrap done. Next step:
     [echo]   ant -f prepare.xml prepare

BUILD SUCCESSFUL
Total time: 0 seconds
[AntLib-antunit] $ /home/jenkins/tools/ant/apache-ant-1.9.9/bin/ant -file prepare.xml prepare
Buildfile: <https://builds.apache.org/job/AntLib-antunit/ws/prepare.xml>

get-antunit:

prepare:
     [echo] Preparation done. Next steps:
     [echo]  ant clean distribution
     [echo]  ant -lib ant-antunit.jar -lib build/lib test

BUILD SUCCESSFUL
Total time: 0 seconds
[AntLib-antunit] $ /home/jenkins/tools/ant/apache-ant-1.9.9/bin/ant clean distribution
Buildfile: <https://builds.apache.org/job/AntLib-antunit/ws/build.xml>

setup-properties:

clean:
   [delete] Deleting directory <https://builds.apache.org/job/AntLib-antunit/ws/build>

setup-properties:

setup:
    [mkdir] Created dir: <https://builds.apache.org/job/AntLib-antunit/ws/build/classes>
    [mkdir] Created dir: <https://builds.apache.org/job/AntLib-antunit/ws/build/test-classes>
    [mkdir] Created dir: <https://builds.apache.org/job/AntLib-antunit/ws/build/lib>

download-ivy:
     [echo] installing ivy...
      [get] Getting: http://repo1.maven.org/maven2/org/apache/ivy/ivy/2.4.0/ivy-2.4.0.jar
      [get] To: <https://builds.apache.org/job/AntLib-antunit/ws/ivy/ivy.jar>
      [get] Not modified - so not downloaded

install-ivy:

-no-resolve:

resolve:
[ivy:resolve] :: Apache Ivy 2.4.0 - 20141213170938 :: http://ant.apache.org/ivy/ ::
[ivy:resolve] :: loading settings :: url = jar:<https://builds.apache.org/job/AntLib-antunit/ws/ivy/ivy.jar!/org/apache/ivy/core/settings/ivysettings.xml>
[ivy:resolve] :: resolving dependencies :: org.apache.ant#ant-antunit;1.5alpha
[ivy:resolve] 	confs: [default, provided, test]
[ivy:resolve] 	found junit#junit;4.12 in default
[ivy:resolve] 	found org.hamcrest#hamcrest-core;1.3 in default
[ivy:resolve] :: resolution report :: resolve 607ms :: artifacts dl 5ms
	---------------------------------------------------------------------
	|                  |            modules            ||   artifacts   |
	|       conf       | number| search|dwnlded|evicted|| number|dwnlded|
	---------------------------------------------------------------------
	|      default     |   2   |   0   |   0   |   0   ||   2   |   0   |
	|     provided     |   1   |   0   |   0   |   0   ||   0   |   0   |
	|       test       |   1   |   0   |   0   |   0   ||   0   |   0   |
	---------------------------------------------------------------------
[ivy:resolve] 
[ivy:resolve] :: problems summary ::
[ivy:resolve] :::: WARNINGS
[ivy:resolve] 		module not found: org.apache.ant#ant;1.8.1
[ivy:resolve] 	==== local: tried
[ivy:resolve] 	  /home/jenkins/.ivy2/local/org.apache.ant/ant/1.8.1/ivys/ivy.xml
[ivy:resolve] 	  -- artifact org.apache.ant#ant;1.8.1!ant.jar:
[ivy:resolve] 	  /home/jenkins/.ivy2/local/org.apache.ant/ant/1.8.1/jars/ant.jar
[ivy:resolve] 	==== shared: tried
[ivy:resolve] 	  /home/jenkins/.ivy2/shared/org.apache.ant/ant/1.8.1/ivys/ivy.xml
[ivy:resolve] 	  -- artifact org.apache.ant#ant;1.8.1!ant.jar:
[ivy:resolve] 	  /home/jenkins/.ivy2/shared/org.apache.ant/ant/1.8.1/jars/ant.jar
[ivy:resolve] 	==== public: tried
[ivy:resolve] 	  https://repo1.maven.org/maven2/org/apache/ant/ant/1.8.1/ant-1.8.1.pom
[ivy:resolve] 	  -- artifact org.apache.ant#ant;1.8.1!ant.jar:
[ivy:resolve] 	  https://repo1.maven.org/maven2/org/apache/ant/ant/1.8.1/ant-1.8.1.jar
[ivy:resolve] 		module not found: org.apache.ant#ant-testutil;1.8.1
[ivy:resolve] 	==== local: tried
[ivy:resolve] 	  /home/jenkins/.ivy2/local/org.apache.ant/ant-testutil/1.8.1/ivys/ivy.xml
[ivy:resolve] 	  -- artifact org.apache.ant#ant-testutil;1.8.1!ant-testutil.jar:
[ivy:resolve] 	  /home/jenkins/.ivy2/local/org.apache.ant/ant-testutil/1.8.1/jars/ant-testutil.jar
[ivy:resolve] 	==== shared: tried
[ivy:resolve] 	  /home/jenkins/.ivy2/shared/org.apache.ant/ant-testutil/1.8.1/ivys/ivy.xml
[ivy:resolve] 	  -- artifact org.apache.ant#ant-testutil;1.8.1!ant-testutil.jar:
[ivy:resolve] 	  /home/jenkins/.ivy2/shared/org.apache.ant/ant-testutil/1.8.1/jars/ant-testutil.jar
[ivy:resolve] 	==== public: tried
[ivy:resolve] 	  https://repo1.maven.org/maven2/org/apache/ant/ant-testutil/1.8.1/ant-testutil-1.8.1.pom
[ivy:resolve] 	  -- artifact org.apache.ant#ant-testutil;1.8.1!ant-testutil.jar:
[ivy:resolve] 	  https://repo1.maven.org/maven2/org/apache/ant/ant-testutil/1.8.1/ant-testutil-1.8.1.jar
[ivy:resolve] 		::::::::::::::::::::::::::::::::::::::::::::::
[ivy:resolve] 		::          UNRESOLVED DEPENDENCIES         ::
[ivy:resolve] 		::::::::::::::::::::::::::::::::::::::::::::::
[ivy:resolve] 		:: org.apache.ant#ant;1.8.1: not found
[ivy:resolve] 		:: org.apache.ant#ant-testutil;1.8.1: not found
[ivy:resolve] 		::::::::::::::::::::::::::::::::::::::::::::::
[ivy:resolve] :::: ERRORS
[ivy:resolve] 	Server access error at url https://repo1.maven.org/maven2/org/apache/ant/ant/1.8.1/ant-1.8.1.pom
(javax.net.ssl.SSLException: Received fatal alert: protocol_version)
[ivy:resolve] 	Server access error at url https://repo1.maven.org/maven2/org/apache/ant/ant/1.8.1/ant-1.8.1.jar
(javax.net.ssl.SSLException: Received fatal alert: protocol_version)
[ivy:resolve] 	Server access error at url https://repo1.maven.org/maven2/org/apache/ant/ant-testutil/1.8.1/ant-testutil-1.8.1.pom
(javax.net.ssl.SSLException: Received fatal alert: protocol_version)
[ivy:resolve] 	Server access error at url https://repo1.maven.org/maven2/org/apache/ant/ant-testutil/1.8.1/ant-testutil-1.8.1.jar
(javax.net.ssl.SSLException: Received fatal alert: protocol_version)
[ivy:resolve] 
[ivy:resolve] :: USE VERBOSE OR DEBUG MESSAGE LEVEL FOR MORE DETAILS

BUILD FAILED
<https://builds.apache.org/job/AntLib-antunit/ws/common/ivy.xml>:147: impossible to
resolve dependencies:
	resolve failed - see output for details

Total time: 2 seconds
Build step 'Invoke Ant' marked build as failure
[WARNINGS] Skipping publisher since build result is FAILURE
[TASKS] Skipping publisher since build result is FAILURE
Archiving artifacts
Recording test results
ERROR: Step ?Publish JUnit test result report? failed: No test report files were found. Configuration
error?
Publishing Javadoc

Mime
View raw message