ant-notifications mailing list archives

Site index · List index
Message view « Date » · « Thread »
Top « Date » · « Thread »
From Apache Jenkins Server <jenk...@builds.apache.org>
Subject Build failed in Jenkins: IvyDE #383
Date Mon, 17 Dec 2018 17:10:04 GMT
See <https://builds.apache.org/job/IvyDE/383/display/redirect>

------------------------------------------
[...truncated 164.22 KB...]
      [get] ....................................................
      [get] ....................................................
      [get] ....................................................
      [get] ....................................................
      [get] ....................................................
      [get] ....................................................
      [get] ....................................................
      [get] ....................................................
      [get] ....................................................
      [get] ....................................................
      [get] ....................................................
      [get] ....................................................
      [get] ....................................................
      [get] ....................................................
      [get] ....................................................
      [get] ....................................................
      [get] ....................................................
      [get] ....................................................
      [get] ....................................................
      [get] ....................................................
      [get] ....................................................
      [get] ....................................................
      [get] ....................................................
      [get] ....................................................
      [get] ....................................................
      [get] ....................................................
      [get] ....................................................
      [get] ....................................................
      [get] ....................................................
      [get] ....................................................
      [get] ....................................................
      [get] ....................................................
      [get] ....................................................
      [get] ....................................................
      [get] ....................................................
      [get] ....................................................
      [get] ....................................................
      [get] ....................................................
      [get] ....................................................
      [get] ....................................................
      [get] ....................................................
      [get] ....................................................
      [get] ....................................................
      [get] ....................................................
      [get] ....................................................
      [get] ....................................................
      [get] ....................................................
      [get] ....................................................
      [get] ....................................................
      [get] ....................................................
      [get] ....................................................
      [get] ....................................................
      [get] ....................................................
      [get] ....................................................
      [get] ....................................................
      [get] ....................................................
      [get] ....................................................
      [get] ....................................................
      [get] ....................................................
      [get] ....................................................
      [get] ....................................................
      [get] ....................................................
      [get] ....................................................
      [get] ....................................................
      [get] ....................................................
      [get] ....................................................
      [get] ....................................................
      [get] ................

eclipse-check-download-emf:

eclipse-get-emf:
      [get] Getting: http://download.eclipse.org/modeling/emf/emf/downloads/drops/2.9.2/R201402031126/emf-runtime-2.9.2.zip
      [get] To: <https://builds.apache.org/job/IvyDE/ws/dependencies/emf-runtime-2.9.2.zip>
      [get] http://download.eclipse.org/modeling/emf/emf/downloads/drops/2.9.2/R201402031126/emf-runtime-2.9.2.zip
moved to http://ftp.osuosl.org/pub/eclipse/modeling/emf/emf/downloads/drops/2.9.2/R201402031126/emf-runtime-2.9.2.zip
      [get] ....................................................
      [get] ....................................................
      [get] ....................................................
      [get] ....................................................
      [get] ...........................................

eclipse-check-download-xsd:

eclipse-get-xsd:
      [get] Getting: http://download.eclipse.org/modeling/emf/emf/downloads/drops/2.9.2/R201402031126/xsd-runtime-2.9.2.zip
      [get] To: <https://builds.apache.org/job/IvyDE/ws/dependencies/xsd-runtime-2.9.2.zip>
      [get] ....................................................
      [get] ....................................................
      [get] ....................................................
      [get] ....................................................
      [get] ....................................................
      [get] ....

eclipse-check-download-gef:

eclipse-get-gef:
      [get] Getting: http://archive.eclipse.org/tools/gef/downloads/drops/3.9.100/R201405261516/GEF-SDK-3.9.100.zip
      [get] To: <https://builds.apache.org/job/IvyDE/ws/dependencies/GEF-SDK-3.9.100.zip>
      [get] ....................................................
      [get] ....................................................
      [get] ....................................................
      [get] ....................................................
      [get] ....................................................
      [get] ....................................................
      [get] ....................................................
      [get] ....................................................
      [get] ....................................................
      [get] ....................................................
      [get] ....................................................
      [get] ....................................................
      [get] ....................................................
      [get] ....................................................
      [get] ....................................................
      [get] ....................................................
      [get] ....................................................
      [get] ....................................................
      [get] ....................................................
      [get] ....................................................
      [get] ....................................................
      [get] ....................................................
      [get] ....................................................
      [get] ....................................................
      [get] ....................................................
      [get] ....................................................
      [get] ....................................................
      [get] ....................................................
      [get] ....................................................
      [get] ....................................................
      [get] ....................................................
      [get] ....................................................
      [get] ....................................................
      [get] ....................................................
      [get] ....................................................
      [get] ....................................................
      [get] ....................................................
      [get] ....................................................
      [get] ....................................................
      [get] .......

eclipse-check-download-zest:

eclipse-get-zest:
      [get] Getting: http://archive.eclipse.org/tools/gef/downloads/drops/3.9.100/R201405261516/GEF-zest-3.9.100.zip
      [get] To: <https://builds.apache.org/job/IvyDE/ws/dependencies/GEF-zest-3.9.100.zip>
      [get] ....................................................
      [get] ....................................................
      [get] ....................................................
      [get] ....................................................
      [get] ....................................................
      [get] ..........................

download-eclipse:

check-unzip-eclipse:

unzip-eclipse:
    [unzip] Expanding: <https://builds.apache.org/job/IvyDE/ws/dependencies/eclipse-SDK-4.3.2-win32.zip>
into <https://builds.apache.org/job/IvyDE/ws/dependencies>
    [mkdir] Created dir: <https://builds.apache.org/job/IvyDE/ws/dependencies/eclipse/dropins/wtp-repo-R-3.9.5-20180409100740>
    [unzip] Expanding: <https://builds.apache.org/job/IvyDE/ws/dependencies/wtp-repo-R-3.9.5-20180409100740.zip>
into <https://builds.apache.org/job/IvyDE/ws/dependencies/eclipse/dropins/wtp-repo-R-3.9.5-20180409100740>
    [mkdir] Created dir: <https://builds.apache.org/job/IvyDE/ws/dependencies/eclipse/dropins/emf-runtime-2.9.2>
    [unzip] Expanding: <https://builds.apache.org/job/IvyDE/ws/dependencies/emf-runtime-2.9.2.zip>
into <https://builds.apache.org/job/IvyDE/ws/dependencies/eclipse/dropins/emf-runtime-2.9.2>
    [mkdir] Created dir: <https://builds.apache.org/job/IvyDE/ws/dependencies/eclipse/dropins/xsd-runtime-2.9.2>
    [unzip] Expanding: <https://builds.apache.org/job/IvyDE/ws/dependencies/xsd-runtime-2.9.2.zip>
into <https://builds.apache.org/job/IvyDE/ws/dependencies/eclipse/dropins/xsd-runtime-2.9.2>
    [mkdir] Created dir: <https://builds.apache.org/job/IvyDE/ws/dependencies/eclipse/dropins/GEF-SDK-3.9.100>
    [unzip] Expanding: <https://builds.apache.org/job/IvyDE/ws/dependencies/GEF-SDK-3.9.100.zip>
into <https://builds.apache.org/job/IvyDE/ws/dependencies/eclipse/dropins/GEF-SDK-3.9.100>
    [mkdir] Created dir: <https://builds.apache.org/job/IvyDE/ws/dependencies/eclipse/dropins/GEF-zest-3.9.100>
    [unzip] Expanding: <https://builds.apache.org/job/IvyDE/ws/dependencies/GEF-zest-3.9.100.zip>
into <https://builds.apache.org/job/IvyDE/ws/dependencies/eclipse/dropins/GEF-zest-3.9.100>

prepare-eclipse:

jenkins-prepare-properties:

jenkins-install-ivy:

check-baseLocation:

get-ivy-jar:

download-ivy:

init-ivy:

compute-ivy-bundle-version:
     [echo] Ivy Bundle-Version: 2.5.0.cr2_20181206005343

install-ivy-jar:
     [copy] Copying 1 file to <https://builds.apache.org/job/IvyDE/ws/dependencies/eclipse-SDK-4.3.2-win32/plugins>
     [echo] Ivy 2.5.0.cr2_20181206005343 has been installed in <https://builds.apache.org/job/IvyDE/ws/dependencies/eclipse-SDK-4.3.2-win32>

install-ivy:

jenkins-prepare:

BUILD SUCCESSFUL
Total time: 7 minutes 27 seconds
[IvyDE] $ /home/jenkins/tools/ant/apache-ant-1.9.9/bin/ant dist checkstyle rat
Buildfile: <https://builds.apache.org/job/IvyDE/ws/build.xml>

clean-eclipse-doc:

generate-sample-zip:
      [zip] Building zip: <https://builds.apache.org/job/IvyDE/ws/doc/src/sample/webapp-js-repo.zip>

download-ivy:
    [mkdir] Created dir: <https://builds.apache.org/job/IvyDE/ws/work>
      [get] Getting: http://repo1.maven.org/maven2/org/apache/ivy/ivy/2.5.0-rc1/ivy-2.5.0-rc1.jar
      [get] To: <https://builds.apache.org/job/IvyDE/ws/work/ivy.jar>

init-ivy:

init-asciidoctor-extensions:
[ivy:cachepath] :: Apache Ivy 2.5.0-rc1 - 20180412005306 :: http://ant.apache.org/ivy/ ::
[ivy:cachepath] :: loading settings :: url = jar:<https://builds.apache.org/job/IvyDE/ws/work/ivy.jar!/org/apache/ivy/core/settings/ivysettings.xml>
[ivy:cachepath] 
[ivy:cachepath] :: problems summary ::
[ivy:cachepath] :::: WARNINGS
[ivy:cachepath] 		module not found: org.asciidoctor#asciidoctorj;1.5.6
[ivy:cachepath] 	==== local: tried
[ivy:cachepath] 	  /home/jenkins/.ivy2/local/org.asciidoctor/asciidoctorj/1.5.6/ivys/ivy.xml
[ivy:cachepath] 	  -- artifact org.asciidoctor#asciidoctorj;1.5.6!asciidoctorj.jar:
[ivy:cachepath] 	  /home/jenkins/.ivy2/local/org.asciidoctor/asciidoctorj/1.5.6/jars/asciidoctorj.jar
[ivy:cachepath] 	==== shared: tried
[ivy:cachepath] 	  /home/jenkins/.ivy2/shared/org.asciidoctor/asciidoctorj/1.5.6/ivys/ivy.xml
[ivy:cachepath] 	  -- artifact org.asciidoctor#asciidoctorj;1.5.6!asciidoctorj.jar:
[ivy:cachepath] 	  /home/jenkins/.ivy2/shared/org.asciidoctor/asciidoctorj/1.5.6/jars/asciidoctorj.jar
[ivy:cachepath] 	==== public: tried
[ivy:cachepath] 	  https://repo1.maven.org/maven2/org/asciidoctor/asciidoctorj/1.5.6/asciidoctorj-1.5.6.pom
[ivy:cachepath] 	  -- artifact org.asciidoctor#asciidoctorj;1.5.6!asciidoctorj.jar:
[ivy:cachepath] 	  https://repo1.maven.org/maven2/org/asciidoctor/asciidoctorj/1.5.6/asciidoctorj-1.5.6.jar
[ivy:cachepath] 		::::::::::::::::::::::::::::::::::::::::::::::
[ivy:cachepath] 		::          UNRESOLVED DEPENDENCIES         ::
[ivy:cachepath] 		::::::::::::::::::::::::::::::::::::::::::::::
[ivy:cachepath] 		:: org.asciidoctor#asciidoctorj;1.5.6: not found
[ivy:cachepath] 		::::::::::::::::::::::::::::::::::::::::::::::
[ivy:cachepath] :::: ERRORS
[ivy:cachepath] 	Server access error at url https://repo1.maven.org/maven2/org/asciidoctor/asciidoctorj/1.5.6/asciidoctorj-1.5.6.pom
(javax.net.ssl.SSLException: Received fatal alert: protocol_version)
[ivy:cachepath] 	Server access error at url https://repo1.maven.org/maven2/org/asciidoctor/asciidoctorj/1.5.6/asciidoctorj-1.5.6.jar
(javax.net.ssl.SSLException: Received fatal alert: protocol_version)
[ivy:cachepath] 
[ivy:cachepath] :: USE VERBOSE OR DEBUG MESSAGE LEVEL FOR MORE DETAILS

BUILD FAILED
<https://builds.apache.org/job/IvyDE/ws/build.xml>:68: impossible to resolve dependencies:
	resolve failed - see output for details

Total time: 2 seconds
Build step 'Invoke Ant' marked build as failure
[locks-and-latches] Releasing all the locks
[locks-and-latches] All the locks released
Archiving artifacts

Mime
View raw message