ant-notifications mailing list archives

Site index · List index
Message view « Date » · « Thread »
Top « Date » · « Thread »
From Apache Jenkins Server <jenk...@builds.apache.org>
Subject Build failed in Jenkins: IvyDE #382
Date Fri, 10 Aug 2018 12:57:30 GMT
See <https://builds.apache.org/job/IvyDE/382/display/redirect?page=changes>

Changes:

[gintas] Revise messages

------------------------------------------
[...truncated 308.62 KB...]
[pde-build] customAssembly:
[pde-build] 
[pde-build] jar.processing:
[pde-build] 
[pde-build] customAssembly:
[pde-build] 
[pde-build] assemble.archive:
[pde-build] 
[pde-build] customAssembly:
[pde-build] 
[pde-build] cleanup.assembly:
[pde-build]    [delete] Deleting directory <https://builds.apache.org/job/IvyDE/ws/work/eclipse/tmp>
[pde-build] 
[pde-build] generate.p2.metadata:
[pde-build] [p2.generator] Generating metadata for ..
[pde-build] [p2.generator] Generation completed with success [0 seconds].
[pde-build] 
[pde-build] init:
[pde-build] 
[pde-build] packageElement:
[pde-build] 
[pde-build] main:
[pde-build] 
[pde-build] assemble.org.apache.ivyde.eclipse.resolvevisualizer.feature:
[pde-build] 
[pde-build] main:
[pde-build]     [mkdir] Created dir: <https://builds.apache.org/job/IvyDE/ws/work/eclipse/tmp>
[pde-build] 
[pde-build] gather.bin.parts:
[pde-build] 
[pde-build] customAssembly:
[pde-build] 
[pde-build] jar.processing:
[pde-build] 
[pde-build] customAssembly:
[pde-build] 
[pde-build] assemble.archive:
[pde-build] 
[pde-build] customAssembly:
[pde-build] 
[pde-build] cleanup.assembly:
[pde-build]    [delete] Deleting directory <https://builds.apache.org/job/IvyDE/ws/work/eclipse/tmp>
[pde-build] 
[pde-build] generate.p2.metadata:
[pde-build] [p2.generator] Generating metadata for ..
[pde-build] [p2.generator] Generation completed with success [0 seconds].
[pde-build] 
[pde-build] postPackage:
[pde-build] 
[pde-build] postBuild:
[pde-build] 
[pde-build] postBuild:
[pde-build] 
[pde-build] gatherLogs:
[pde-build]     [mkdir] Created dir: <https://builds.apache.org/job/IvyDE/ws/work/eclipse/2.3.0.rc1-201808101256-jenkins-382/compilelogs>
[pde-build] 
[pde-build] allElements:
[pde-build] 
[pde-build] allElementsDelegator:
[pde-build] 
[pde-build] init:
[pde-build] 
[pde-build] gatherLogs:
[pde-build] 
[pde-build] init:
[pde-build] 
[pde-build] zip.logs:
[pde-build]     [mkdir] Created dir: <https://builds.apache.org/job/IvyDE/ws/work/eclipse/features/org.apache.ivyde.feature/feature.temp.folder>
[pde-build] 
[pde-build] init:
[pde-build] 
[pde-build] all.features:
[pde-build] 
[pde-build] all.plugins:
[pde-build] 
[pde-build] properties:
[pde-build] 
[pde-build] init:
[pde-build] 
[pde-build] gather.logs:
[pde-build]     [mkdir] Created dir: <https://builds.apache.org/job/IvyDE/ws/work/eclipse/features/org.apache.ivyde.feature/feature.temp.folder/plugins/org.apache.ivyde.eclipse_2.3.0.rc1-201808101256-jenkins-382>
[pde-build]      [copy] Copying 1 file to <https://builds.apache.org/job/IvyDE/ws/work/eclipse/features/org.apache.ivyde.feature/feature.temp.folder/plugins/org.apache.ivyde.eclipse_2.3.0.rc1-201808101256-jenkins-382>
[pde-build] 
[pde-build] update.feature:
[pde-build] 
[pde-build] all.children:
[pde-build]       [zip] Building zip: <https://builds.apache.org/job/IvyDE/ws/work/eclipse/features/org.apache.ivyde.feature/org.apache.ivyde.feature_2.3.0.rc1-201808101256-jenkins-382.log.zip>
[pde-build]    [delete] Deleting directory <https://builds.apache.org/job/IvyDE/ws/work/eclipse/features/org.apache.ivyde.feature/feature.temp.folder>
[pde-build] 
[pde-build] init:
[pde-build] 
[pde-build] gatherLogs:
[pde-build] 
[pde-build] init:
[pde-build] 
[pde-build] zip.logs:
[pde-build]     [mkdir] Created dir: <https://builds.apache.org/job/IvyDE/ws/work/eclipse/features/org.apache.ivyde.eclipse.resolvevisualizer.feature/feature.temp.folder>
[pde-build] 
[pde-build] init:
[pde-build] 
[pde-build] all.features:
[pde-build] 
[pde-build] all.plugins:
[pde-build] 
[pde-build] properties:
[pde-build] 
[pde-build] init:
[pde-build] 
[pde-build] gather.logs:
[pde-build]     [mkdir] Created dir: <https://builds.apache.org/job/IvyDE/ws/work/eclipse/features/org.apache.ivyde.eclipse.resolvevisualizer.feature/feature.temp.folder/plugins/org.apache.ivyde.eclipse.resolvevisualizer_2.3.0.rc1-201808101256-jenkins-382>
[pde-build]      [copy] Copying 1 file to <https://builds.apache.org/job/IvyDE/ws/work/eclipse/features/org.apache.ivyde.eclipse.resolvevisualizer.feature/feature.temp.folder/plugins/org.apache.ivyde.eclipse.resolvevisualizer_2.3.0.rc1-201808101256-jenkins-382>
[pde-build] 
[pde-build] update.feature:
[pde-build] 
[pde-build] all.children:
[pde-build]       [zip] Building zip: <https://builds.apache.org/job/IvyDE/ws/work/eclipse/features/org.apache.ivyde.eclipse.resolvevisualizer.feature/org.apache.ivyde.eclipse.resolvevisualizer.feature_2.3.0.rc1-201808101256-jenkins-382.log.zip>
[pde-build]    [delete] Deleting directory <https://builds.apache.org/job/IvyDE/ws/work/eclipse/features/org.apache.ivyde.eclipse.resolvevisualizer.feature/feature.temp.folder>
[pde-build]     [unzip] Expanding: <https://builds.apache.org/job/IvyDE/ws/work/eclipse/features/org.apache.ivyde.eclipse.resolvevisualizer.feature/org.apache.ivyde.eclipse.resolvevisualizer.feature_2.3.0.rc1-201808101256-jenkins-382.log.zip>
into <https://builds.apache.org/job/IvyDE/ws/work/eclipse/2.3.0.rc1-201808101256-jenkins-382/compilelogs>
[pde-build]     [unzip] Expanding: <https://builds.apache.org/job/IvyDE/ws/work/eclipse/features/org.apache.ivyde.feature/org.apache.ivyde.feature_2.3.0.rc1-201808101256-jenkins-382.log.zip>
into <https://builds.apache.org/job/IvyDE/ws/work/eclipse/2.3.0.rc1-201808101256-jenkins-382/compilelogs>
[pde-build] BUILD SUCCESSFUL
[pde-build] 
[pde-build] BUILD SUCCESSFUL
[pde-build] Total time: 12 seconds

generate-p2-category:
     [java] Generating metadata for ..
     [java] Generation completed with success [0 seconds].

generate-dist-doc-files:
    [mkdir] Created dir: <https://builds.apache.org/job/IvyDE/ws/work/dist/apache-ivyde-2.3.0.rc1-201808101256-jenkins-382/doc>
     [copy] Copying 88 files to <https://builds.apache.org/job/IvyDE/ws/work/dist/apache-ivyde-2.3.0.rc1-201808101256-jenkins-382/doc>

generate-dist-doc-articles:
[asciidoctor:convert] Render asciidoc files from <https://builds.apache.org/job/IvyDE/ws/doc/src>
to <https://builds.apache.org/job/IvyDE/ws/work/dist/apache-ivyde-2.3.0.rc1-201808101256-jenkins-382/doc>
with backend=xhtml5

generate-dist-doc-book-adoc:
    [mkdir] Created dir: <https://builds.apache.org/job/IvyDE/ws/work/book>

generate-dist-doc-book:
[asciidoctor:convert] Render asciidoc files from <https://builds.apache.org/job/IvyDE/ws/work/book>
to <https://builds.apache.org/job/IvyDE/ws/work/dist/apache-ivyde-2.3.0.rc1-201808101256-jenkins-382/doc>
with backend=xhtml5
[asciidoctor:convert] asciidoctor: WARNING: include file has illegal reference to ancestor
of jail, auto-recovering
[asciidoctor:convert] asciidoctor: WARNING: include file has illegal reference to ancestor
of jail, auto-recovering
[asciidoctor:convert] asciidoctor: WARNING: include file has illegal reference to ancestor
of jail, auto-recovering
[asciidoctor:convert] asciidoctor: WARNING: include file has illegal reference to ancestor
of jail, auto-recovering
[asciidoctor:convert] asciidoctor: ERROR: book.adoc: line 50: invalid part, must have at least
one section (e.g., chapter, appendix, etc.)
[asciidoctor:convert] asciidoctor: WARNING: include file has illegal reference to ancestor
of jail, auto-recovering
[asciidoctor:convert] asciidoctor: WARNING: include file has illegal reference to ancestor
of jail, auto-recovering
[asciidoctor:convert] asciidoctor: WARNING: include file has illegal reference to ancestor
of jail, auto-recovering
[asciidoctor:convert] asciidoctor: WARNING: include file has illegal reference to ancestor
of jail, auto-recovering
[asciidoctor:convert] asciidoctor: WARNING: include file has illegal reference to ancestor
of jail, auto-recovering
[asciidoctor:convert] asciidoctor: WARNING: include file has illegal reference to ancestor
of jail, auto-recovering
[asciidoctor:convert] asciidoctor: WARNING: include file has illegal reference to ancestor
of jail, auto-recovering
[asciidoctor:convert] asciidoctor: WARNING: include file has illegal reference to ancestor
of jail, auto-recovering
[asciidoctor:convert] asciidoctor: WARNING: include file has illegal reference to ancestor
of jail, auto-recovering
[asciidoctor:convert] asciidoctor: WARNING: include file has illegal reference to ancestor
of jail, auto-recovering
[asciidoctor:convert] asciidoctor: WARNING: include file has illegal reference to ancestor
of jail, auto-recovering
[asciidoctor:convert] asciidoctor: WARNING: include file has illegal reference to ancestor
of jail, auto-recovering
[asciidoctor:convert] asciidoctor: WARNING: include file has illegal reference to ancestor
of jail, auto-recovering
[asciidoctor:convert] asciidoctor: WARNING: include file has illegal reference to ancestor
of jail, auto-recovering
[asciidoctor:convert] asciidoctor: WARNING: include file has illegal reference to ancestor
of jail, auto-recovering
[asciidoctor:convert] asciidoctor: WARNING: include file has illegal reference to ancestor
of jail, auto-recovering
[asciidoctor:convert] asciidoctor: WARNING: include file has illegal reference to ancestor
of jail, auto-recovering
[asciidoctor:convert] asciidoctor: WARNING: include file has illegal reference to ancestor
of jail, auto-recovering
[asciidoctor:convert] asciidoctor: WARNING: include file has illegal reference to ancestor
of jail, auto-recovering
[asciidoctor:convert] asciidoctor: WARNING: include file has illegal reference to ancestor
of jail, auto-recovering
[asciidoctor:convert] asciidoctor: WARNING: include file has illegal reference to ancestor
of jail, auto-recovering
[asciidoctor:convert] asciidoctor: ERROR: book.adoc: line 134: invalid part, must have at
least one section (e.g., chapter, appendix, etc.)
[asciidoctor:convert] asciidoctor: WARNING: include file has illegal reference to ancestor
of jail, auto-recovering
[asciidoctor:convert] asciidoctor: WARNING: include file has illegal reference to ancestor
of jail, auto-recovering
[asciidoctor:convert] asciidoctor: WARNING: include file has illegal reference to ancestor
of jail, auto-recovering
[asciidoctor:convert] asciidoctor: WARNING: include file has illegal reference to ancestor
of jail, auto-recovering

generate-dist-doc-html:

package-binaries:
    [unzip] Expanding: <https://builds.apache.org/job/IvyDE/ws/work/eclipse/2.3.0.rc1-201808101256-jenkins-382/org.apache.ivyde.feature-2.3.0.rc1-201808101256-jenkins-382.zip>
into <https://builds.apache.org/job/IvyDE/ws/work/dist/apache-ivyde-2.3.0.rc1-201808101256-jenkins-382>
    [unzip] Expanding: <https://builds.apache.org/job/IvyDE/ws/work/eclipse/2.3.0.rc1-201808101256-jenkins-382/org.apache.ivyde.eclipse.resolvevisualizer.feature-2.3.0.rc1-201808101256-jenkins-382.zip>
into <https://builds.apache.org/job/IvyDE/ws/work/dist/apache-ivyde-2.3.0.rc1-201808101256-jenkins-382>
     [copy] Copying 2 files to <https://builds.apache.org/job/IvyDE/ws/work/dist/apache-ivyde-2.3.0.rc1-201808101256-jenkins-382>
     [copy] Copying 2 files to <https://builds.apache.org/job/IvyDE/ws/work/dist/apache-ivyde-2.3.0.rc1-201808101256-jenkins-382>
    [mkdir] Created dir: <https://builds.apache.org/job/IvyDE/ws/dist>
      [zip] Building zip: <https://builds.apache.org/job/IvyDE/382/artifact/dist/apache-ivyde-2.3.0.rc1-201808101256-jenkins-382.zip>
      [tar] Building tar: <https://builds.apache.org/job/IvyDE/382/artifact/dist/apache-ivyde-2.3.0.rc1-201808101256-jenkins-382.tar.gz>
      [tar] Entry: apache-ivyde-2.3.0.rc1-201808101256-jenkins-382/doc/images/sec_add_credentials_duplicate_resolved.png
longer than 100 characters.
      [tar] Resulting tar file can only be processed successfully by GNU compatible tar commands
      [tar] Entry: apache-ivyde-2.3.0.rc1-201808101256-jenkins-382/features/org.apache.ivyde.eclipse.resolvevisualizer.feature_2.3.0.rc1-201808101256-jenkins-382.jar
longer than 100 characters.
      [tar] Entry: apache-ivyde-2.3.0.rc1-201808101256-jenkins-382/features/org.apache.ivyde.feature_2.3.0.rc1-201808101256-jenkins-382.jar
longer than 100 characters.
      [tar] Entry: apache-ivyde-2.3.0.rc1-201808101256-jenkins-382/plugins/org.apache.ivyde.eclipse.resolvevisualizer_2.3.0.rc1-201808101256-jenkins-382.jar
longer than 100 characters.
      [tar] Entry: apache-ivyde-2.3.0.rc1-201808101256-jenkins-382/plugins/org.apache.ivyde.eclipse_2.3.0.rc1-201808101256-jenkins-382.jar
longer than 100 characters.

package-sources:

checksum:

dist:

download-ivy:

init-ivy:

checkstyle-internal:
[ivy:cachepath] ivy.instance reference an ivy:settings defined in an other classloader.  An
new default one will be used in this project.
[ivy:cachepath] :: Apache Ivy 2.5.0-rc1 - 20180412005306 :: http://ant.apache.org/ivy/ ::
[ivy:cachepath] :: loading settings :: url = jar:<https://builds.apache.org/job/IvyDE/ws/work/ivy.jar!/org/apache/ivy/core/settings/ivysettings.xml>
[ivy:cachepath] :: resolving dependencies :: com.puppycrawl.tools#checkstyle-caller;working
[ivy:cachepath] 	confs: [default]
[ivy:cachepath] :: resolution report :: resolve 375ms :: artifacts dl 0ms
	---------------------------------------------------------------------
	|                  |            modules            ||   artifacts   |
	|       conf       | number| search|dwnlded|evicted|| number|dwnlded|
	---------------------------------------------------------------------
	|      default     |   1   |   0   |   0   |   0   ||   0   |   0   |
	---------------------------------------------------------------------
[ivy:cachepath] 
[ivy:cachepath] :: problems summary ::
[ivy:cachepath] :::: WARNINGS
[ivy:cachepath] 		module not found: com.puppycrawl.tools#checkstyle;6.19
[ivy:cachepath] 	==== local: tried
[ivy:cachepath] 	  /home/jenkins/.ivy2/local/com.puppycrawl.tools/checkstyle/6.19/ivys/ivy.xml
[ivy:cachepath] 	  -- artifact com.puppycrawl.tools#checkstyle;6.19!checkstyle.jar:
[ivy:cachepath] 	  /home/jenkins/.ivy2/local/com.puppycrawl.tools/checkstyle/6.19/jars/checkstyle.jar
[ivy:cachepath] 	==== shared: tried
[ivy:cachepath] 	  /home/jenkins/.ivy2/shared/com.puppycrawl.tools/checkstyle/6.19/ivys/ivy.xml
[ivy:cachepath] 	  -- artifact com.puppycrawl.tools#checkstyle;6.19!checkstyle.jar:
[ivy:cachepath] 	  /home/jenkins/.ivy2/shared/com.puppycrawl.tools/checkstyle/6.19/jars/checkstyle.jar
[ivy:cachepath] 	==== public: tried
[ivy:cachepath] 	  https://repo1.maven.org/maven2/com/puppycrawl/tools/checkstyle/6.19/checkstyle-6.19.pom
[ivy:cachepath] 	  -- artifact com.puppycrawl.tools#checkstyle;6.19!checkstyle.jar:
[ivy:cachepath] 	  https://repo1.maven.org/maven2/com/puppycrawl/tools/checkstyle/6.19/checkstyle-6.19.jar
[ivy:cachepath] 		::::::::::::::::::::::::::::::::::::::::::::::
[ivy:cachepath] 		::          UNRESOLVED DEPENDENCIES         ::
[ivy:cachepath] 		::::::::::::::::::::::::::::::::::::::::::::::
[ivy:cachepath] 		:: com.puppycrawl.tools#checkstyle;6.19: not found
[ivy:cachepath] 		::::::::::::::::::::::::::::::::::::::::::::::
[ivy:cachepath] :::: ERRORS
[ivy:cachepath] 	Server access error at url https://repo1.maven.org/maven2/com/puppycrawl/tools/checkstyle/6.19/checkstyle-6.19.pom
(javax.net.ssl.SSLException: Received fatal alert: protocol_version)
[ivy:cachepath] 	Server access error at url https://repo1.maven.org/maven2/com/puppycrawl/tools/checkstyle/6.19/checkstyle-6.19.jar
(javax.net.ssl.SSLException: Received fatal alert: protocol_version)
[ivy:cachepath] 
[ivy:cachepath] :: USE VERBOSE OR DEBUG MESSAGE LEVEL FOR MORE DETAILS

BUILD FAILED
<https://builds.apache.org/job/IvyDE/ws/build.xml>:514: impossible to resolve dependencies:
	resolve failed - see output for details

Total time: 1 minute 1 second
Build step 'Invoke Ant' marked build as failure
[locks-and-latches] Releasing all the locks
[locks-and-latches] All the locks released
Archiving artifacts
[Fast Archiver] Compressed 30.24 MB of artifacts by 21.3% relative to #381

Mime
View raw message