ant-notifications mailing list archives

Site index · List index
Message view « Date » · « Thread »
Top « Date » · « Thread »
From Apache Jenkins Server <jenk...@builds.apache.org>
Subject Build failed in Jenkins: Ant-Build-Matrix-master-Linux » JDK 1.8 (latest) #1011
Date Sat, 20 Jan 2018 09:12:29 GMT
See <https://builds.apache.org/job/Ant-Build-Matrix-master-Linux/jdk=JDK%201.8%20(latest)/1011/display/redirect?page=changes>

Changes:

[gintas] Revised installation manual, cross-referenced optional tasks/types

------------------------------------------
Started by upstream project "Ant-Build-Matrix-master-Linux" build number 1011
originally caused by:
 Started by an SCM change
[EnvInject] - Loading node environment variables.
Building remotely on beam7 (beam) in workspace <https://builds.apache.org/job/Ant-Build-Matrix-master-Linux/jdk=JDK%201.8%20(latest)/ws/>
 > git rev-parse --is-inside-work-tree # timeout=10
Fetching changes from the remote Git repository
 > git config remote.origin.url https://git-wip-us.apache.org/repos/asf/ant.git # timeout=10
Cleaning workspace
 > git rev-parse --verify HEAD # timeout=10
Resetting working tree
 > git reset --hard # timeout=10
 > git clean -fdx # timeout=10
Fetching upstream changes from https://git-wip-us.apache.org/repos/asf/ant.git
 > git --version # timeout=10
 > git fetch --tags --progress https://git-wip-us.apache.org/repos/asf/ant.git +refs/heads/*:refs/remotes/origin/*
Checking out Revision 0da54795ca415988a47f5061c850473fe24c8580 (refs/remotes/origin/master)
 > git config core.sparsecheckout # timeout=10
 > git checkout -f 0da54795ca415988a47f5061c850473fe24c8580
Commit message: "Revised installation manual, cross-referenced optional tasks/types"
 > git rev-list b3d141a5df0d4617a0c1c7bd950b543014425c50 # timeout=10
[EnvInject] - Executing scripts and injecting environment variables after the SCM step.
[EnvInject] - Injecting as environment variables the properties content 
LANG=en_US.utf8

[EnvInject] - Variables injected successfully.
[JDK 1.8 (latest)] $ /home/jenkins/tools/ant/latest/bin/ant -file launch-build.xml "-Djdk=JDK
1.8 (latest)"
Buildfile: <https://builds.apache.org/job/Ant-Build-Matrix-master-Linux/jdk=JDK%201.8%20(latest)/ws/launch-build.xml>

launch:
     [echo] Launching <https://builds.apache.org/job/Ant-Build-Matrix-master-Linux/jdk=JDK%201.8%20(latest)/ws/build.sh>
allclean test -Dignore.tests.failed=true -Doptional.jars.whenmanifestonly=skip
     [exec] ... Bootstrapping Ant Distribution
     [exec] ... Compiling Ant Classes
     [exec] Note: Some input files use or override a deprecated API.
     [exec] Note: Recompile with -Xlint:deprecation for details.
     [exec] Note: Some input files use unchecked or unsafe operations.
     [exec] Note: Recompile with -Xlint:unchecked for details.
     [exec] ... Copying Required Files
     [exec] ... Building Ant Distribution
     [exec] Buildfile: <https://builds.apache.org/job/Ant-Build-Matrix-master-Linux/jdk=JDK%201.8%20(latest)/ws/build.xml>
     [exec] ... Failed Building Ant Distribution !
     [exec] Bootstrap FAILED
     [exec] 
     [exec] BUILD FAILED
     [exec] <https://builds.apache.org/job/Ant-Build-Matrix-master-Linux/jdk=JDK%201.8%20(latest)/ws/build.xml>:1605:
Element type "target" must be followed by either attribute specifications, ">" or "/>".
     [exec] 
     [exec] Total time: 0 seconds

BUILD FAILED
<https://builds.apache.org/job/Ant-Build-Matrix-master-Linux/jdk=JDK%201.8%20(latest)/ws/launch-build.xml>:36:
exec returned: 1

Total time: 13 seconds
Build step 'Invoke Ant' marked build as failure
Recording test results
ERROR: Step ‘Publish JUnit test result report’ failed: No test report files were found.
Configuration error?


Mime
View raw message