ant-notifications mailing list archives

Site index · List index
Message view « Date » · « Thread »
Top « Date » · « Thread »
From Apache Jenkins Server <jenk...@builds.apache.org>
Subject Build failed in Jenkins: Ant-Build-Matrix-1.9.x-Windows » JDK 1.5 (Latest 64 bit on Windows only),Windows #64
Date Sat, 02 Dec 2017 17:42:33 GMT
See <https://builds.apache.org/job/Ant-Build-Matrix-1.9.x-Windows/jdk=JDK%201.5%20(Latest%2064%20bit%20on%20Windows%20only),label_exp=Windows/64/display/redirect?page=changes>

Changes:

[bodewig] forgot to record new javac10+ compiler option

------------------------------------------
Started by upstream project "Ant-Build-Matrix-1.9.x-Windows" build number 64
originally caused by:
 Started by an SCM change
[EnvInject] - Loading node environment variables.
Building remotely on windows-2012-2 (Windows) in workspace <https://builds.apache.org/job/Ant-Build-Matrix-1.9.x-Windows/jdk=JDK%201.5%20(Latest%2064%20bit%20on%20Windows%20only),label_exp=Windows/ws/>
 > git rev-parse --is-inside-work-tree # timeout=10
Fetching changes from the remote Git repository
 > git config remote.origin.url https://git-wip-us.apache.org/repos/asf/ant.git # timeout=10
Cleaning workspace
 > git rev-parse --verify HEAD # timeout=10
Resetting working tree
 > git reset --hard # timeout=10
 > git clean -fdx # timeout=10
Fetching upstream changes from https://git-wip-us.apache.org/repos/asf/ant.git
 > git --version # timeout=10
 > git fetch --tags --progress https://git-wip-us.apache.org/repos/asf/ant.git +refs/heads/*:refs/remotes/origin/*
Checking out Revision b9f78abff6f85c62d3a98d8ebc74c054f4a12096 (refs/remotes/origin/1.9.x)
 > git config core.sparsecheckout # timeout=10
 > git checkout -f b9f78abff6f85c62d3a98d8ebc74c054f4a12096
Commit message: "forgot to record new javac10+ compiler option"
 > git rev-list bd0759d943a7717e43d1d774afc4c3e1cb2bc04c # timeout=10
[EnvInject] - Executing scripts and injecting environment variables after the SCM step.
[EnvInject] - Injecting as environment variables the properties content 
LANG=en_US.utf8

[EnvInject] - Variables injected successfully.
[Windows] $ cmd.exe /C "F:\jenkins\tools\ant\apache-ant-1.9.9\bin\ant.bat -file launch-build.xml
'"-Djdk=JDK 1.5 (Latest 64 bit on Windows only)"' -Dlabel_exp=Windows && exit %%ERRORLEVEL%%"
Buildfile: <https://builds.apache.org/job/Ant-Build-Matrix-1.9.x-Windows/jdk=JDK%201.5%20(Latest%2064%20bit%20on%20Windows%20only),label_exp=Windows/ws/launch-build.xml>

launch:
     [echo] Launching <https://builds.apache.org/job/Ant-Build-Matrix-1.9.x-Windows/jdk=JDK%201.5%20(Latest%2064%20bit%20on%20Windows%20only),label_exp=Windows/ws/build.bat>
allclean test -Dignore.tests.failed=true -Doptional.jars.whenmanifestonly=skip
     [exec] 
     [exec] ... Bootstrapping Ant Distribution
     [exec] JAVA_HOME=F:\\hudson\\tools\\java\\jdk1.5.0_22-64
     [exec] JAVA=F:\\hudson\\tools\\java\\jdk1.5.0_22-64\bin\java
     [exec] JAVAC=F:\\hudson\\tools\\java\\jdk1.5.0_22-64\bin\javac
     [exec] CLASSPATH=;lib\optional\ant-antunit-1.3.jar;lib\optional\hamcrest-core-1.3.jar;lib\optional\junit-3.8.2.jar;lib\optional\junit-4.11.jar;F:\\hudson\\tools\\java\\jdk1.5.0_22-64\lib\tools.jar;build\classes;src\main;
     [exec] ANT_HOME=.
     [exec] 
     [exec] ... Compiling Ant Classes
     [exec] Note: Some input files use or override a deprecated API.
     [exec] Note: Recompile with -Xlint:deprecation for details.
     [exec] Note: Some input files use unchecked or unsafe operations.
     [exec] Note: Recompile with -Xlint:unchecked for details.
     [exec] 
     [exec] ... Copying Required Files
     [exec] src\main\org\apache\tools\ant\taskdefs\defaults.properties
     [exec]         1 file(s) copied.
     [exec] src\main\org\apache\tools\ant\types\defaults.properties
     [exec]         1 file(s) copied.
     [exec] 
     [exec] ... Building Ant Distribution
     [exec] Buildfile: <https://builds.apache.org/job/Ant-Build-Matrix-1.9.x-Windows/jdk=JDK%201.5%20(Latest%2064%20bit%20on%20Windows%20only),label_exp=Windows/ws/build.xml>
     [exec] 
     [exec] bootstrap:
     [exec] 
     [exec] prepare:
     [exec] 
     [exec] check_for_optional_packages:
     [exec] 
     [exec] build:
     [exec] Created dir: <https://builds.apache.org/job/Ant-Build-Matrix-1.9.x-Windows/jdk=JDK%201.5%20(Latest%2064%20bit%20on%20Windows%20only),label_exp=Windows/ws/build\lib>
     [exec] Compiling 270 source files to <https://builds.apache.org/job/Ant-Build-Matrix-1.9.x-Windows/jdk=JDK%201.5%20(Latest%2064%20bit%20on%20Windows%20only),label_exp=Windows/ws/build\classes>
     [exec] Note: Some input files use or override a deprecated API.
     [exec] Note: Recompile with -Xlint:deprecation for details.
     [exec] Note: Some input files use unchecked or unsafe operations.
     [exec] Note: Recompile with -Xlint:unchecked for details.
     [exec] Copying 6 files to <https://builds.apache.org/job/Ant-Build-Matrix-1.9.x-Windows/jdk=JDK%201.5%20(Latest%2064%20bit%20on%20Windows%20only),label_exp=Windows/ws/build\classes>
     [exec] Copying 2 files to <https://builds.apache.org/job/Ant-Build-Matrix-1.9.x-Windows/jdk=JDK%201.5%20(Latest%2064%20bit%20on%20Windows%20only),label_exp=Windows/ws/build\classes>
     [exec] Copying 2 files to <https://builds.apache.org/job/Ant-Build-Matrix-1.9.x-Windows/jdk=JDK%201.5%20(Latest%2064%20bit%20on%20Windows%20only),label_exp=Windows/ws/build\classes\org\apache\tools\ant\taskdefs\optional\junit\xsl>
     [exec] 
     [exec] jars:
     [exec] Copying 2 files to <https://builds.apache.org/job/Ant-Build-Matrix-1.9.x-Windows/jdk=JDK%201.5%20(Latest%2064%20bit%20on%20Windows%20only),label_exp=Windows/ws/build>
     [exec] Copying 1 file to <https://builds.apache.org/job/Ant-Build-Matrix-1.9.x-Windows/jdk=JDK%201.5%20(Latest%2064%20bit%20on%20Windows%20only),label_exp=Windows/ws/build>
     [exec] Building jar: <https://builds.apache.org/job/Ant-Build-Matrix-1.9.x-Windows/jdk=JDK%201.5%20(Latest%2064%20bit%20on%20Windows%20only),label_exp=Windows/ws/build\lib\ant-launcher.jar>
     [exec] Building jar: <https://builds.apache.org/job/Ant-Build-Matrix-1.9.x-Windows/jdk=JDK%201.5%20(Latest%2064%20bit%20on%20Windows%20only),label_exp=Windows/ws/build\lib\ant.jar>
     [exec] Building jar: <https://builds.apache.org/job/Ant-Build-Matrix-1.9.x-Windows/jdk=JDK%201.5%20(Latest%2064%20bit%20on%20Windows%20only),label_exp=Windows/ws/build\lib\ant-bootstrap.jar>
     [exec] Building jar: <https://builds.apache.org/job/Ant-Build-Matrix-1.9.x-Windows/jdk=JDK%201.5%20(Latest%2064%20bit%20on%20Windows%20only),label_exp=Windows/ws/build\lib\ant-apache-resolver.jar>
     [exec] Building jar: <https://builds.apache.org/job/Ant-Build-Matrix-1.9.x-Windows/jdk=JDK%201.5%20(Latest%2064%20bit%20on%20Windows%20only),label_exp=Windows/ws/build\lib\ant-junit.jar>
     [exec] Building jar: <https://builds.apache.org/job/Ant-Build-Matrix-1.9.x-Windows/jdk=JDK%201.5%20(Latest%2064%20bit%20on%20Windows%20only),label_exp=Windows/ws/build\lib\ant-junit4.jar>
     [exec] Building jar: <https://builds.apache.org/job/Ant-Build-Matrix-1.9.x-Windows/jdk=JDK%201.5%20(Latest%2064%20bit%20on%20Windows%20only),label_exp=Windows/ws/build\lib\ant-apache-regexp.jar>
     [exec] Building jar: <https://builds.apache.org/job/Ant-Build-Matrix-1.9.x-Windows/jdk=JDK%201.5%20(Latest%2064%20bit%20on%20Windows%20only),label_exp=Windows/ws/build\lib\ant-apache-oro.jar>
     [exec] Building jar: <https://builds.apache.org/job/Ant-Build-Matrix-1.9.x-Windows/jdk=JDK%201.5%20(Latest%2064%20bit%20on%20Windows%20only),label_exp=Windows/ws/build\lib\ant-apache-bcel.jar>
     [exec] Building jar: <https://builds.apache.org/job/Ant-Build-Matrix-1.9.x-Windows/jdk=JDK%201.5%20(Latest%2064%20bit%20on%20Windows%20only),label_exp=Windows/ws/build\lib\ant-apache-log4j.jar>
     [exec] Building jar: <https://builds.apache.org/job/Ant-Build-Matrix-1.9.x-Windows/jdk=JDK%201.5%20(Latest%2064%20bit%20on%20Windows%20only),label_exp=Windows/ws/build\lib\ant-commons-logging.jar>
     [exec] Building jar: <https://builds.apache.org/job/Ant-Build-Matrix-1.9.x-Windows/jdk=JDK%201.5%20(Latest%2064%20bit%20on%20Windows%20only),label_exp=Windows/ws/build\lib\ant-apache-bsf.jar>
     [exec] Building jar: <https://builds.apache.org/job/Ant-Build-Matrix-1.9.x-Windows/jdk=JDK%201.5%20(Latest%2064%20bit%20on%20Windows%20only),label_exp=Windows/ws/build\lib\ant-javamail.jar>
     [exec] Building jar: <https://builds.apache.org/job/Ant-Build-Matrix-1.9.x-Windows/jdk=JDK%201.5%20(Latest%2064%20bit%20on%20Windows%20only),label_exp=Windows/ws/build\lib\ant-netrexx.jar>
     [exec] Building jar: <https://builds.apache.org/job/Ant-Build-Matrix-1.9.x-Windows/jdk=JDK%201.5%20(Latest%2064%20bit%20on%20Windows%20only),label_exp=Windows/ws/build\lib\ant-commons-net.jar>
     [exec] Building jar: <https://builds.apache.org/job/Ant-Build-Matrix-1.9.x-Windows/jdk=JDK%201.5%20(Latest%2064%20bit%20on%20Windows%20only),label_exp=Windows/ws/build\lib\ant-antlr.jar>
     [exec] Building jar: <https://builds.apache.org/job/Ant-Build-Matrix-1.9.x-Windows/jdk=JDK%201.5%20(Latest%2064%20bit%20on%20Windows%20only),label_exp=Windows/ws/build\lib\ant-jmf.jar>
     [exec] Building jar: <https://builds.apache.org/job/Ant-Build-Matrix-1.9.x-Windows/jdk=JDK%201.5%20(Latest%2064%20bit%20on%20Windows%20only),label_exp=Windows/ws/build\lib\ant-jai.jar>
     [exec] Building jar: <https://builds.apache.org/job/Ant-Build-Matrix-1.9.x-Windows/jdk=JDK%201.5%20(Latest%2064%20bit%20on%20Windows%20only),label_exp=Windows/ws/build\lib\ant-swing.jar>
     [exec] Building jar: <https://builds.apache.org/job/Ant-Build-Matrix-1.9.x-Windows/jdk=JDK%201.5%20(Latest%2064%20bit%20on%20Windows%20only),label_exp=Windows/ws/build\lib\ant-jsch.jar>
     [exec] Building jar: <https://builds.apache.org/job/Ant-Build-Matrix-1.9.x-Windows/jdk=JDK%201.5%20(Latest%2064%20bit%20on%20Windows%20only),label_exp=Windows/ws/build\lib\ant-jdepend.jar>
     [exec] Building jar: <https://builds.apache.org/job/Ant-Build-Matrix-1.9.x-Windows/jdk=JDK%201.5%20(Latest%2064%20bit%20on%20Windows%20only),label_exp=Windows/ws/build\lib\ant-apache-xalan2.jar>
     [exec] 
     [exec] compile-tests:
     [exec] Created dir: <https://builds.apache.org/job/Ant-Build-Matrix-1.9.x-Windows/jdk=JDK%201.5%20(Latest%2064%20bit%20on%20Windows%20only),label_exp=Windows/ws/build\testcases>
     [exec] Compiling 309 source files to <https://builds.apache.org/job/Ant-Build-Matrix-1.9.x-Windows/jdk=JDK%201.5%20(Latest%2064%20bit%20on%20Windows%20only),label_exp=Windows/ws/build\testcases>
     [exec] <https://builds.apache.org/job/Ant-Build-Matrix-1.9.x-Windows/jdk=JDK%201.5%20(Latest%2064%20bit%20on%20Windows%20only),label_exp=Windows/ws/src\tests\junit\org\apache\tools\ant\taskdefs\optional\junit\JUnitTestRunnerTest.java>:257:
cannot find symbol
     [exec] symbol  : constructor AssertionError(java.lang.String,java.lang.RuntimeException)
     [exec] location: class java.lang.AssertionError
     [exec]             throw new AssertionError("failure message", new RuntimeException("cause
message"));
     [exec]                   ^
     [exec] <https://builds.apache.org/job/Ant-Build-Matrix-1.9.x-Windows/jdk=JDK%201.5%20(Latest%2064%20bit%20on%20Windows%20only),label_exp=Windows/ws/src\tests\junit\org\apache\tools\ant\types\selectors\ModifiedSelectorTest.java>:950:
cannot find symbol
     [exec] symbol  : method lineSeparator()
     [exec] location: class java.lang.System
     [exec]                 out.write(System.lineSeparator());
     [exec]                                 ^
     [exec] Note: Some input files use or override a deprecated API.
     [exec] Note: Recompile with -Xlint:deprecation for details.
     [exec] Note: Some input files use unchecked or unsafe operations.
     [exec] Note: Recompile with -Xlint:unchecked for details.
     [exec] 2 errors
     [exec] 
     [exec] BUILD FAILED
     [exec] <https://builds.apache.org/job/Ant-Build-Matrix-1.9.x-Windows/jdk=JDK%201.5%20(Latest%2064%20bit%20on%20Windows%20only),label_exp=Windows/ws/build.xml>:1079:
The following error occurred while executing this line:
     [exec] <https://builds.apache.org/job/Ant-Build-Matrix-1.9.x-Windows/jdk=JDK%201.5%20(Latest%2064%20bit%20on%20Windows%20only),label_exp=Windows/ws/build.xml>:1506:
Compile failed; see the compiler error output for details.
     [exec] 
     [exec] Total time: 7 seconds
     [exec] 
     [exec] ... Cleaning Up Build Directories
     [exec] 
     [exec] ... Done Bootstrapping Ant Distribution
     [exec] Bootstrap FAILED

BUILD SUCCESSFUL
Total time: 12 seconds
Recording test results
ERROR: Step ‘Publish JUnit test result report’ failed: No test report files were found.
Configuration error?


Mime
View raw message