ant-notifications mailing list archives

Site index · List index
Message view « Date » · « Thread »
Top « Date » · « Thread »
From Apache Jenkins Server <jenk...@builds.apache.org>
Subject Build failed in Jenkins: Ant-Build-Matrix-1.9.x-Linux » JDK 1.5 (latest) #120
Date Fri, 01 Dec 2017 20:50:15 GMT
See <https://builds.apache.org/job/Ant-Build-Matrix-1.9.x-Linux/jdk=JDK%201.5%20(latest)/120/display/redirect?page=changes>

Changes:

[gintas] Checkstyle: mostly whitespace (cf master)

------------------------------------------
Started by upstream project "Ant-Build-Matrix-1.9.x-Linux" build number 120
originally caused by:
 Started by an SCM change
[EnvInject] - Loading node environment variables.
Building remotely on ubuntu-2 (ubuntu trusty) in workspace <https://builds.apache.org/job/Ant-Build-Matrix-1.9.x-Linux/jdk=JDK%201.5%20(latest)/ws/>
Cloning the remote Git repository
Cloning repository https://git-wip-us.apache.org/repos/asf/ant.git
 > git init <https://builds.apache.org/job/Ant-Build-Matrix-1.9.x-Linux/jdk=JDK%201.5%20(latest)/ws/>
# timeout=10
Fetching upstream changes from https://git-wip-us.apache.org/repos/asf/ant.git
 > git --version # timeout=10
 > git fetch --tags --progress https://git-wip-us.apache.org/repos/asf/ant.git +refs/heads/*:refs/remotes/origin/*
 > git config remote.origin.url https://git-wip-us.apache.org/repos/asf/ant.git # timeout=10
 > git config --add remote.origin.fetch +refs/heads/*:refs/remotes/origin/* # timeout=10
 > git config remote.origin.url https://git-wip-us.apache.org/repos/asf/ant.git # timeout=10
Cleaning workspace
 > git rev-parse --verify HEAD # timeout=10
No valid HEAD. Skipping the resetting
 > git clean -fdx # timeout=10
Fetching upstream changes from https://git-wip-us.apache.org/repos/asf/ant.git
 > git fetch --tags --progress https://git-wip-us.apache.org/repos/asf/ant.git +refs/heads/*:refs/remotes/origin/*
Checking out Revision 572a249025f0d8df78e4373784f716751df73db0 (refs/remotes/origin/1.9.x)
 > git config core.sparsecheckout # timeout=10
 > git checkout -f 572a249025f0d8df78e4373784f716751df73db0
Commit message: "Checkstyle: mostly whitespace (cf master)"
 > git rev-list 0ed7f4ab51a47e717b35d14e5af46b124e183f9c # timeout=10
[EnvInject] - Executing scripts and injecting environment variables after the SCM step.
[EnvInject] - Injecting as environment variables the properties content 
LANG=en_US.utf8

[EnvInject] - Variables injected successfully.
[JDK 1.5 (latest)] $ /home/jenkins/tools/ant/apache-ant-1.9.9/bin/ant -file launch-build.xml
"-Djdk=JDK 1.5 (latest)"
Buildfile: <https://builds.apache.org/job/Ant-Build-Matrix-1.9.x-Linux/jdk=JDK%201.5%20(latest)/ws/launch-build.xml>

launch:
     [echo] Launching <https://builds.apache.org/job/Ant-Build-Matrix-1.9.x-Linux/jdk=JDK%201.5%20(latest)/ws/build.sh>
allclean test -Dignore.tests.failed=true -Doptional.jars.whenmanifestonly=skip
     [exec] ... Bootstrapping Ant Distribution
     [exec] ... Compiling Ant Classes
     [exec] Note: Some input files use or override a deprecated API.
     [exec] Note: Recompile with -Xlint:deprecation for details.
     [exec] Note: Some input files use unchecked or unsafe operations.
     [exec] Note: Recompile with -Xlint:unchecked for details.
     [exec] ... Copying Required Files
     [exec] ... Building Ant Distribution
     [exec] Buildfile: <https://builds.apache.org/job/Ant-Build-Matrix-1.9.x-Linux/jdk=JDK%201.5%20(latest)/ws/build.xml>
     [exec] 
     [exec] bootstrap:
     [exec] 
     [exec] prepare:
     [exec] 
     [exec] check_for_optional_packages:
     [exec] 
     [exec] build:
     [exec] Created dir: <https://builds.apache.org/job/Ant-Build-Matrix-1.9.x-Linux/jdk=JDK%201.5%20(latest)/ws/build/lib>
     [exec] Compiling 270 source files to <https://builds.apache.org/job/Ant-Build-Matrix-1.9.x-Linux/jdk=JDK%201.5%20(latest)/ws/build/classes>
     [exec] Note: Some input files use or override a deprecated API.
     [exec] Note: Recompile with -Xlint:deprecation for details.
     [exec] Note: Some input files use unchecked or unsafe operations.
     [exec] Note: Recompile with -Xlint:unchecked for details.
     [exec] Copying 6 files to <https://builds.apache.org/job/Ant-Build-Matrix-1.9.x-Linux/jdk=JDK%201.5%20(latest)/ws/build/classes>
     [exec] Copying 2 files to <https://builds.apache.org/job/Ant-Build-Matrix-1.9.x-Linux/jdk=JDK%201.5%20(latest)/ws/build/classes>
     [exec] Copying 2 files to <https://builds.apache.org/job/Ant-Build-Matrix-1.9.x-Linux/jdk=JDK%201.5%20(latest)/ws/build/classes/org/apache/tools/ant/taskdefs/optional/junit/xsl>
     [exec] 
     [exec] jars:
     [exec] Copying 2 files to <https://builds.apache.org/job/Ant-Build-Matrix-1.9.x-Linux/jdk=JDK%201.5%20(latest)/ws/build>
     [exec] Copying 1 file to <https://builds.apache.org/job/Ant-Build-Matrix-1.9.x-Linux/jdk=JDK%201.5%20(latest)/ws/build>
     [exec] Building jar: <https://builds.apache.org/job/Ant-Build-Matrix-1.9.x-Linux/jdk=JDK%201.5%20(latest)/ws/build/lib/ant-launcher.jar>
     [exec] Building jar: <https://builds.apache.org/job/Ant-Build-Matrix-1.9.x-Linux/jdk=JDK%201.5%20(latest)/ws/build/lib/ant.jar>
     [exec] Building jar: <https://builds.apache.org/job/Ant-Build-Matrix-1.9.x-Linux/jdk=JDK%201.5%20(latest)/ws/build/lib/ant-bootstrap.jar>
     [exec] Building jar: <https://builds.apache.org/job/Ant-Build-Matrix-1.9.x-Linux/jdk=JDK%201.5%20(latest)/ws/build/lib/ant-apache-resolver.jar>
     [exec] Building jar: <https://builds.apache.org/job/Ant-Build-Matrix-1.9.x-Linux/jdk=JDK%201.5%20(latest)/ws/build/lib/ant-junit.jar>
     [exec] Building jar: <https://builds.apache.org/job/Ant-Build-Matrix-1.9.x-Linux/jdk=JDK%201.5%20(latest)/ws/build/lib/ant-junit4.jar>
     [exec] Building jar: <https://builds.apache.org/job/Ant-Build-Matrix-1.9.x-Linux/jdk=JDK%201.5%20(latest)/ws/build/lib/ant-apache-regexp.jar>
     [exec] Building jar: <https://builds.apache.org/job/Ant-Build-Matrix-1.9.x-Linux/jdk=JDK%201.5%20(latest)/ws/build/lib/ant-apache-oro.jar>
     [exec] Building jar: <https://builds.apache.org/job/Ant-Build-Matrix-1.9.x-Linux/jdk=JDK%201.5%20(latest)/ws/build/lib/ant-apache-bcel.jar>
     [exec] Building jar: <https://builds.apache.org/job/Ant-Build-Matrix-1.9.x-Linux/jdk=JDK%201.5%20(latest)/ws/build/lib/ant-apache-log4j.jar>
     [exec] Building jar: <https://builds.apache.org/job/Ant-Build-Matrix-1.9.x-Linux/jdk=JDK%201.5%20(latest)/ws/build/lib/ant-commons-logging.jar>
     [exec] Building jar: <https://builds.apache.org/job/Ant-Build-Matrix-1.9.x-Linux/jdk=JDK%201.5%20(latest)/ws/build/lib/ant-apache-bsf.jar>
     [exec] Building jar: <https://builds.apache.org/job/Ant-Build-Matrix-1.9.x-Linux/jdk=JDK%201.5%20(latest)/ws/build/lib/ant-javamail.jar>
     [exec] Building jar: <https://builds.apache.org/job/Ant-Build-Matrix-1.9.x-Linux/jdk=JDK%201.5%20(latest)/ws/build/lib/ant-netrexx.jar>
     [exec] Building jar: <https://builds.apache.org/job/Ant-Build-Matrix-1.9.x-Linux/jdk=JDK%201.5%20(latest)/ws/build/lib/ant-commons-net.jar>
     [exec] Building jar: <https://builds.apache.org/job/Ant-Build-Matrix-1.9.x-Linux/jdk=JDK%201.5%20(latest)/ws/build/lib/ant-antlr.jar>
     [exec] Building jar: <https://builds.apache.org/job/Ant-Build-Matrix-1.9.x-Linux/jdk=JDK%201.5%20(latest)/ws/build/lib/ant-jmf.jar>
     [exec] Building jar: <https://builds.apache.org/job/Ant-Build-Matrix-1.9.x-Linux/jdk=JDK%201.5%20(latest)/ws/build/lib/ant-jai.jar>
     [exec] Building jar: <https://builds.apache.org/job/Ant-Build-Matrix-1.9.x-Linux/jdk=JDK%201.5%20(latest)/ws/build/lib/ant-swing.jar>
     [exec] Building jar: <https://builds.apache.org/job/Ant-Build-Matrix-1.9.x-Linux/jdk=JDK%201.5%20(latest)/ws/build/lib/ant-jsch.jar>
     [exec] Building jar: <https://builds.apache.org/job/Ant-Build-Matrix-1.9.x-Linux/jdk=JDK%201.5%20(latest)/ws/build/lib/ant-jdepend.jar>
     [exec] Building jar: <https://builds.apache.org/job/Ant-Build-Matrix-1.9.x-Linux/jdk=JDK%201.5%20(latest)/ws/build/lib/ant-apache-xalan2.jar>
     [exec] 
     [exec] compile-tests:
     [exec] Created dir: <https://builds.apache.org/job/Ant-Build-Matrix-1.9.x-Linux/jdk=JDK%201.5%20(latest)/ws/build/testcases>
     [exec] Compiling 309 source files to <https://builds.apache.org/job/Ant-Build-Matrix-1.9.x-Linux/jdk=JDK%201.5%20(latest)/ws/build/testcases>
     [exec] <https://builds.apache.org/job/Ant-Build-Matrix-1.9.x-Linux/jdk=JDK%201.5%20(latest)/ws/src/tests/junit/org/apache/tools/ant/taskdefs/optional/junit/JUnitTestRunnerTest.java>:257:
cannot find symbol
     [exec] symbol  : constructor AssertionError(java.lang.String,java.lang.RuntimeException)
     [exec] location: class java.lang.AssertionError
     [exec]             throw new AssertionError("failure message", new RuntimeException("cause
message"));
     [exec]                   ^
     [exec] 
     [exec] BUILD FAILED
     [exec] <https://builds.apache.org/job/Ant-Build-Matrix-1.9.x-Linux/jdk=JDK%201.5%20(latest)/ws/build.xml>:1076:
The following error occurred while executing this line:
     [exec] <https://builds.apache.org/job/Ant-Build-Matrix-1.9.x-Linux/jdk=JDK%201.5%20(latest)/ws/build.xml>:1503:
Compile failed; see the compiler error output for details.
     [exec] 
     [exec] Total time: 6 seconds
     [exec] <https://builds.apache.org/job/Ant-Build-Matrix-1.9.x-Linux/jdk=JDK%201.5%20(latest)/ws/src/tests/junit/org/apache/tools/ant/types/selectors/ModifiedSelectorTest.java>:950:
cannot find symbol
     [exec] symbol  : method lineSeparator()
     [exec] location: class java.lang.System
     [exec]                 out.write(System.lineSeparator());
     [exec]                                 ^
     [exec] Note: Some input files use or override a deprecated API.
     [exec] Note: Recompile with -Xlint:deprecation for details.
     [exec] Note: Some input files use unchecked or unsafe operations.
     [exec] Note: Recompile with -Xlint:unchecked for details.
     [exec] 2 errors
     [exec] ... Failed Building Ant Distribution !
     [exec] Bootstrap FAILED

BUILD FAILED
<https://builds.apache.org/job/Ant-Build-Matrix-1.9.x-Linux/jdk=JDK%201.5%20(latest)/ws/launch-build.xml>:36:
exec returned: 1

Total time: 12 seconds
Build step 'Invoke Ant' marked build as failure
Recording test results
ERROR: Step ?Publish JUnit test result report? failed: No test report files were found. Configuration
error?


Mime
View raw message