ant-notifications mailing list archives

Site index · List index
Message view « Date » · « Thread »
Top « Date » · « Thread »
From Apache Jenkins Server <jenk...@builds.apache.org>
Subject Build failed in Jenkins: Ivy-tests-ubuntu » ubuntu,JDK 1.7 (latest) #187
Date Mon, 03 Jul 2017 09:49:35 GMT
See <https://builds.apache.org/job/Ivy-tests-ubuntu/OS=ubuntu,jdk=JDK%201.7%20(latest)/187/display/redirect?page=changes>

Changes:

[jaikiran] IVY-1562 Fix potential double encoding of "location" value of "extends"

------------------------------------------
[...truncated 33.33 KB...]
    [junit] Tests run: 13, Failures: 0, Errors: 0, Skipped: 0, Time elapsed: 2,1 sec
    [junit] Running org.apache.ivy.ant.IvyCleanCacheTest
    [junit] Tests run: 5, Failures: 0, Errors: 0, Skipped: 0, Time elapsed: 1,058 sec
    [junit] Running org.apache.ivy.ant.IvyConfigureTest
    [junit] Tests run: 14, Failures: 0, Errors: 0, Skipped: 0, Time elapsed: 1,803 sec
    [junit] Running org.apache.ivy.ant.IvyConvertPomTest
    [junit] Tests run: 1, Failures: 0, Errors: 0, Skipped: 0, Time elapsed: 2,488 sec
    [junit] Running org.apache.ivy.ant.IvyDeliverTest
    [junit] Tests run: 15, Failures: 0, Errors: 0, Skipped: 0, Time elapsed: 4,374 sec
    [junit] Running org.apache.ivy.ant.IvyDependencyTreeTest
    [junit] Tests run: 7, Failures: 0, Errors: 0, Skipped: 0, Time elapsed: 1,971 sec
    [junit] Running org.apache.ivy.ant.IvyDependencyUpdateCheckerTest
    [junit] Tests run: 14, Failures: 0, Errors: 1, Skipped: 0, Time elapsed: 2,955 sec
    [junit] Test org.apache.ivy.ant.IvyDependencyUpdateCheckerTest FAILED
    [junit] Running org.apache.ivy.ant.IvyFindRevisionTest
    [junit] Tests run: 3, Failures: 0, Errors: 0, Skipped: 0, Time elapsed: 1,723 sec
    [junit] Running org.apache.ivy.ant.IvyInfoRepositoryTest
    [junit] Tests run: 3, Failures: 0, Errors: 0, Skipped: 0, Time elapsed: 1,66 sec
    [junit] Running org.apache.ivy.ant.IvyInfoTest
    [junit] Tests run: 4, Failures: 0, Errors: 0, Skipped: 0, Time elapsed: 2,142 sec
    [junit] Running org.apache.ivy.ant.IvyInstallTest
    [junit] Tests run: 15, Failures: 0, Errors: 0, Skipped: 0, Time elapsed: 3,628 sec
    [junit] Running org.apache.ivy.ant.IvyListModulesTest
    [junit] Tests run: 2, Failures: 0, Errors: 0, Skipped: 0, Time elapsed: 1,344 sec
    [junit] Running org.apache.ivy.ant.IvyPostResolveTaskTest
    [junit] Tests run: 13, Failures: 0, Errors: 0, Skipped: 0, Time elapsed: 2,714 sec
    [junit] Running org.apache.ivy.ant.IvyPublishTest
    [junit] Tests run: 22, Failures: 0, Errors: 3, Skipped: 0, Time elapsed: 5,12 sec
    [junit] Test org.apache.ivy.ant.IvyPublishTest FAILED
    [junit] Running org.apache.ivy.ant.IvyReportTest
    [junit] Tests run: 6, Failures: 0, Errors: 0, Skipped: 0, Time elapsed: 2,948 sec
    [junit] Running org.apache.ivy.ant.IvyRepositoryReportTest
    [junit] Tests run: 3, Failures: 0, Errors: 0, Skipped: 0, Time elapsed: 1,523 sec
    [junit] Running org.apache.ivy.ant.IvyResolveTest
    [junit] Tests run: 34, Failures: 0, Errors: 1, Skipped: 1, Time elapsed: 3,508 sec
    [junit] Test org.apache.ivy.ant.IvyResolveTest FAILED
    [junit] Running org.apache.ivy.ant.IvyResourcesTest
    [junit] Tests run: 8, Failures: 0, Errors: 0, Skipped: 0, Time elapsed: 2,839 sec
    [junit] Running org.apache.ivy.ant.IvyRetrieveBuildFileTest
    [junit] Tests run: 1, Failures: 0, Errors: 0, Skipped: 0, Time elapsed: 1,8 sec
    [junit] Running org.apache.ivy.ant.IvyRetrieveTest
    [junit] Tests run: 19, Failures: 0, Errors: 0, Skipped: 0, Time elapsed: 2,559 sec
    [junit] Running org.apache.ivy.ant.IvyTaskTest
    [junit] Tests run: 3, Failures: 0, Errors: 0, Skipped: 0, Time elapsed: 1,098 sec
    [junit] Running org.apache.ivy.ant.IvyVarTest
    [junit] Tests run: 4, Failures: 0, Errors: 0, Skipped: 0, Time elapsed: 1,588 sec
    [junit] Running org.apache.ivy.core.NormalRelativeUrlResolverTest
    [junit] Tests run: 7, Failures: 0, Errors: 0, Skipped: 0, Time elapsed: 0,163 sec
    [junit] Running org.apache.ivy.core.cache.DefaultRepositoryCacheManagerTest
    [junit] Tests run: 3, Failures: 0, Errors: 0, Skipped: 1, Time elapsed: 1,165 sec
    [junit] Running org.apache.ivy.core.cache.ModuleDescriptorMemoryCacheTest
    [junit] Tests run: 10, Failures: 0, Errors: 0, Skipped: 0, Time elapsed: 1,293 sec
    [junit] Running org.apache.ivy.core.deliver.DeliverTest
    [junit] Tests run: 1, Failures: 0, Errors: 0, Skipped: 0, Time elapsed: 2,515 sec
    [junit] Running org.apache.ivy.core.event.IvyEventFilterTest
    [junit] Tests run: 5, Failures: 0, Errors: 0, Skipped: 0, Time elapsed: 0,761 sec
    [junit] Running org.apache.ivy.core.install.InstallTest
    [junit] Tests run: 10, Failures: 0, Errors: 0, Skipped: 0, Time elapsed: 3,378 sec
    [junit] Running org.apache.ivy.core.module.descriptor.DefaultDependencyDescriptorTest
    [junit] Tests run: 2, Failures: 0, Errors: 0, Skipped: 0, Time elapsed: 0,2 sec
    [junit] Running org.apache.ivy.core.module.descriptor.IvyMakePomTest
    [junit] Tests run: 1, Failures: 0, Errors: 0, Skipped: 0, Time elapsed: 1,174 sec
    [junit] Running org.apache.ivy.core.module.id.ModuleIdTest
    [junit] Tests run: 11, Failures: 0, Errors: 0, Skipped: 0, Time elapsed: 0,082 sec
    [junit] Running org.apache.ivy.core.module.id.ModuleRevisionIdTest
    [junit] Tests run: 6, Failures: 0, Errors: 0, Skipped: 0, Time elapsed: 0,255 sec
    [junit] Running org.apache.ivy.core.module.id.ModuleRulesTest
    [junit] Tests run: 2, Failures: 0, Errors: 0, Skipped: 0, Time elapsed: 0,126 sec
    [junit] Running org.apache.ivy.core.publish.PublishEngineTest
    [junit] Tests run: 1, Failures: 0, Errors: 0, Skipped: 0, Time elapsed: 1,459 sec
    [junit] Running org.apache.ivy.core.publish.PublishEventsTest
    [junit] Tests run: 4, Failures: 0, Errors: 0, Skipped: 0, Time elapsed: 1,286 sec
    [junit] Running org.apache.ivy.core.report.ResolveReportTest
    [junit] Tests run: 6, Failures: 0, Errors: 0, Skipped: 0, Time elapsed: 2,084 sec
    [junit] Running org.apache.ivy.core.repository.RepositoryManagementEngineTest
    [junit] Tests run: 2, Failures: 0, Errors: 0, Skipped: 0, Time elapsed: 2,116 sec
    [junit] Running org.apache.ivy.core.resolve.ResolveEngineTest
    [junit] Tests run: 2, Failures: 0, Errors: 0, Skipped: 0, Time elapsed: 1,593 sec
    [junit] Running org.apache.ivy.core.resolve.ResolveTest
    [junit] Tests run: 230, Failures: 0, Errors: 0, Skipped: 0, Time elapsed: 25,223 sec
    [junit] Running org.apache.ivy.core.retrieve.RetrieveTest
    [junit] Tests run: 12, Failures: 0, Errors: 0, Skipped: 0, Time elapsed: 2,948 sec
    [junit] Running org.apache.ivy.core.search.SearchTest
    [junit] Tests run: 3, Failures: 0, Errors: 0, Skipped: 0, Time elapsed: 1,282 sec
    [junit] Running org.apache.ivy.core.settings.ConfigureTest
    [junit] Tests run: 4, Failures: 0, Errors: 0, Skipped: 0, Time elapsed: 1,372 sec
    [junit] Running org.apache.ivy.core.settings.IvySettingsTest
    [junit] Tests run: 2, Failures: 0, Errors: 0, Skipped: 0, Time elapsed: 1,234 sec
    [junit] Running org.apache.ivy.core.settings.OnlineXmlSettingsParserTest
    [junit] Tests run: 4, Failures: 0, Errors: 0, Skipped: 0, Time elapsed: 3,227 sec
    [junit] Running org.apache.ivy.core.settings.XmlSettingsParserTest
    [junit] Tests run: 26, Failures: 0, Errors: 0, Skipped: 0, Time elapsed: 1,238 sec
    [junit] Running org.apache.ivy.core.sort.SortTest
    [junit] Tests run: 8, Failures: 0, Errors: 0, Skipped: 0, Time elapsed: 0,892 sec
    [junit] Running org.apache.ivy.osgi.core.AggregatedOSGiResolverTest
    [junit] Tests run: 3, Failures: 0, Errors: 0, Skipped: 0, Time elapsed: 1,479 sec
    [junit] Running org.apache.ivy.osgi.core.ExecutionEnvironmentProfileLoaderTest
    [junit] Tests run: 1, Failures: 0, Errors: 0, Skipped: 0, Time elapsed: 0,322 sec
    [junit] Running org.apache.ivy.osgi.core.ManifestHeaderTest
    [junit] Tests run: 5, Failures: 0, Errors: 0, Skipped: 0, Time elapsed: 0,169 sec
    [junit] Running org.apache.ivy.osgi.core.ManifestParserTest
    [junit] Tests run: 3, Failures: 0, Errors: 0, Skipped: 0, Time elapsed: 0,145 sec
    [junit] Running org.apache.ivy.osgi.core.OSGiManifestParserTest
    [junit] Tests run: 2, Failures: 0, Errors: 0, Skipped: 0, Time elapsed: 1,046 sec
    [junit] Running org.apache.ivy.osgi.core.OsgiLatestStrategyTest
    [junit] Tests run: 3, Failures: 0, Errors: 0, Skipped: 0, Time elapsed: 1,233 sec
    [junit] Running org.apache.ivy.osgi.filter.OSGiFilterTest
    [junit] Tests run: 4, Failures: 0, Errors: 0, Skipped: 0, Time elapsed: 0,232 sec
    [junit] Running org.apache.ivy.osgi.obr.OBRParserTest
    [junit] Tests run: 2, Failures: 0, Errors: 0, Skipped: 0, Time elapsed: 5,558 sec
    [junit] Running org.apache.ivy.osgi.obr.OBRResolverTest
    [junit] Tests run: 16, Failures: 0, Errors: 0, Skipped: 0, Time elapsed: 1,661 sec
    [junit] Running org.apache.ivy.osgi.obr.OBRXMLWriterTest
    [junit] Tests run: 1, Failures: 0, Errors: 0, Skipped: 0, Time elapsed: 0,904 sec
    [junit] Running org.apache.ivy.osgi.p2.P2DescriptorTest
    [junit] Tests run: 4, Failures: 0, Errors: 0, Skipped: 0, Time elapsed: 1,273 sec
    [junit] Running org.apache.ivy.osgi.repo.BundleRepoTest
    [junit] Tests run: 4, Failures: 0, Errors: 0, Skipped: 0, Time elapsed: 2,891 sec
    [junit] Running org.apache.ivy.osgi.updatesite.UpdateSiteAndIbiblioResolverTest
    [junit] Tests run: 1, Failures: 0, Errors: 0, Skipped: 0, Time elapsed: 2,123 sec
    [junit] Running org.apache.ivy.osgi.updatesite.UpdateSiteLoaderTest
    [junit] Tests run: 4, Failures: 0, Errors: 0, Skipped: 1, Time elapsed: 20,413 sec
    [junit] Running org.apache.ivy.osgi.updatesite.UpdateSiteResolverTest
    [junit] Tests run: 3, Failures: 0, Errors: 0, Skipped: 0, Time elapsed: 1,082 sec
    [junit] Running org.apache.ivy.osgi.util.ParseUtilTest
    [junit] Tests run: 1, Failures: 0, Errors: 0, Skipped: 0, Time elapsed: 0,083 sec
    [junit] Running org.apache.ivy.osgi.util.VersionRangeTest
    [junit] Tests run: 2, Failures: 0, Errors: 0, Skipped: 0, Time elapsed: 0,1 sec
    [junit] Running org.apache.ivy.osgi.util.VersionTest
    [junit] Tests run: 2, Failures: 0, Errors: 0, Skipped: 0, Time elapsed: 0,09 sec
    [junit] Running org.apache.ivy.plugins.circular.IgnoreCircularDependencyStrategyTest
    [junit] Tests run: 2, Failures: 0, Errors: 0, Skipped: 0, Time elapsed: 0,762 sec
    [junit] Running org.apache.ivy.plugins.circular.WarnCircularDependencyStrategyTest
    [junit] Tests run: 3, Failures: 0, Errors: 0, Skipped: 0, Time elapsed: 0,78 sec
    [junit] Running org.apache.ivy.plugins.conflict.LatestCompatibleConflictManagerTest
    [junit] Tests run: 12, Failures: 0, Errors: 0, Skipped: 0, Time elapsed: 3,92 sec
    [junit] Running org.apache.ivy.plugins.conflict.LatestConflictManagerTest
    [junit] Tests run: 6, Failures: 0, Errors: 0, Skipped: 0, Time elapsed: 1,502 sec
    [junit] Running org.apache.ivy.plugins.conflict.RegexpConflictManagerTest
    [junit] Tests run: 2, Failures: 0, Errors: 0, Skipped: 0, Time elapsed: 0,957 sec
    [junit] Running org.apache.ivy.plugins.conflict.StrictConflictManagerTest
    [junit] Tests run: 5, Failures: 0, Errors: 0, Skipped: 0, Time elapsed: 1,139 sec
    [junit] Running org.apache.ivy.plugins.latest.LatestRevisionStrategyTest
    [junit] Tests run: 4, Failures: 0, Errors: 0, Skipped: 0, Time elapsed: 0,767 sec
    [junit] Running org.apache.ivy.plugins.lock.ArtifactLockStrategyTest
    [junit] Tests run: 1, Failures: 0, Errors: 0, Skipped: 0, Time elapsed: 4,76 sec
    [junit] Running org.apache.ivy.plugins.matcher.ExactOrRegexpPatternMatcherTest
    [junit] Tests run: 7, Failures: 0, Errors: 0, Skipped: 0, Time elapsed: 0,376 sec
    [junit] Running org.apache.ivy.plugins.matcher.ExactPatternMatcherTest
    [junit] Tests run: 7, Failures: 0, Errors: 0, Skipped: 0, Time elapsed: 0,184 sec
    [junit] Running org.apache.ivy.plugins.matcher.GlobPatternMatcherTest
    [junit] Tests run: 13, Failures: 0, Errors: 0, Skipped: 0, Time elapsed: 0,768 sec
    [junit] Running org.apache.ivy.plugins.matcher.RegexpPatternMatcherTest
    [junit] Tests run: 7, Failures: 0, Errors: 0, Skipped: 0, Time elapsed: 0,354 sec
    [junit] Running org.apache.ivy.plugins.namespace.MRIDTransformationRuleTest
    [junit] Tests run: 1, Failures: 0, Errors: 0, Skipped: 0, Time elapsed: 0,138 sec
    [junit] Running org.apache.ivy.plugins.namespace.NameSpaceHelperTest
    [junit] Tests run: 1, Failures: 0, Errors: 0, Skipped: 0, Time elapsed: 0,146 sec
    [junit] Running org.apache.ivy.plugins.parser.ModuleDescriptorParserRegistryTest
    [junit] Tests run: 1, Failures: 0, Errors: 0, Skipped: 0, Time elapsed: 0,789 sec
    [junit] Running org.apache.ivy.plugins.parser.m2.PomModuleDescriptorParserTest
    [junit] Tests run: 45, Failures: 0, Errors: 0, Skipped: 0, Time elapsed: 1,669 sec
    [junit] Running org.apache.ivy.plugins.parser.m2.PomModuleDescriptorWriterTest
    [junit] Tests run: 12, Failures: 0, Errors: 0, Skipped: 0, Time elapsed: 1,028 sec
    [junit] Running org.apache.ivy.plugins.parser.xml.XmlModuleDescriptorParserTest
    [junit] Tests run: 44, Failures: 0, Errors: 7, Skipped: 0, Time elapsed: 1,739 sec
    [junit] Test org.apache.ivy.plugins.parser.xml.XmlModuleDescriptorParserTest FAILED
    [junit] Running org.apache.ivy.plugins.parser.xml.XmlModuleDescriptorWriterTest
    [junit] Tests run: 10, Failures: 0, Errors: 1, Skipped: 0, Time elapsed: 1,291 sec
    [junit] Test org.apache.ivy.plugins.parser.xml.XmlModuleDescriptorWriterTest FAILED
    [junit] Running org.apache.ivy.plugins.parser.xml.XmlModuleUpdaterTest
    [junit] Tests run: 10, Failures: 0, Errors: 1, Skipped: 0, Time elapsed: 1,126 sec
    [junit] Test org.apache.ivy.plugins.parser.xml.XmlModuleUpdaterTest FAILED
    [junit] Running org.apache.ivy.plugins.report.XmlReportParserTest
    [junit] Tests run: 1, Failures: 0, Errors: 0, Skipped: 0, Time elapsed: 0,977 sec
    [junit] Running org.apache.ivy.plugins.report.XmlReportWriterTest
    [junit] Tests run: 3, Failures: 0, Errors: 0, Skipped: 0, Time elapsed: 1,375 sec
    [junit] Running org.apache.ivy.plugins.repository.vfs.VfsRepositoryTest
    [junit] Tests run: 7, Failures: 0, Errors: 0, Skipped: 0, Time elapsed: 1,498 sec
    [junit] Running org.apache.ivy.plugins.repository.vfs.VfsResourceTest
    [junit] Tests run: 6, Failures: 0, Errors: 0, Skipped: 0, Time elapsed: 1,282 sec
    [junit] Running org.apache.ivy.plugins.resolver.BintrayResolverTest
    [junit] Tests run: 12, Failures: 0, Errors: 0, Skipped: 0, Time elapsed: 4,356 sec
    [junit] Running org.apache.ivy.plugins.resolver.ChainResolverTest
    [junit] Tests run: 13, Failures: 0, Errors: 0, Skipped: 0, Time elapsed: 1,151 sec
    [junit] Running org.apache.ivy.plugins.resolver.DualResolverTest
    [junit] Tests run: 6, Failures: 0, Errors: 0, Skipped: 0, Time elapsed: 0,824 sec
    [junit] Running org.apache.ivy.plugins.resolver.FileSystemResolverTest
    [junit] Tests run: 27, Failures: 0, Errors: 0, Skipped: 0, Time elapsed: 1,538 sec
    [junit] Running org.apache.ivy.plugins.resolver.IBiblioResolverTest
    [junit] Tests run: 7, Failures: 0, Errors: 0, Skipped: 0, Time elapsed: 3,899 sec
    [junit] Running org.apache.ivy.plugins.resolver.IvyRepResolverTest
    [junit] Tests run: 3, Failures: 0, Errors: 0, Skipped: 0, Time elapsed: 1,306 sec
    [junit] Running org.apache.ivy.plugins.resolver.JarResolverTest
    [junit] Tests run: 3, Failures: 0, Errors: 0, Skipped: 0, Time elapsed: 1,024 sec
    [junit] Running org.apache.ivy.plugins.resolver.Maven2LocalTest
    [junit] Tests run: 2, Failures: 0, Errors: 0, Skipped: 0, Time elapsed: 0,857 sec
    [junit] Running org.apache.ivy.plugins.resolver.MirroredURLResolverTest
    [junit] Tests run: 3, Failures: 0, Errors: 0, Skipped: 0, Time elapsed: 1,431 sec
    [junit] Running org.apache.ivy.plugins.resolver.PackagerResolverTest
    [junit] Tests run: 3, Failures: 0, Errors: 0, Skipped: 0, Time elapsed: 3,521 sec
    [junit] Running org.apache.ivy.plugins.resolver.URLResolverTest
    [junit] Tests run: 9, Failures: 0, Errors: 0, Skipped: 0, Time elapsed: 5,041 sec
    [junit] Running org.apache.ivy.plugins.resolver.VfsResolverTest
    [junit] Tests run: 2, Failures: 0, Errors: 0, Skipped: 0, Time elapsed: 0,302 sec
    [junit] Running org.apache.ivy.plugins.resolver.util.ResolverHelperTest
    [junit] Tests run: 1, Failures: 0, Errors: 0, Skipped: 0, Time elapsed: 0,348 sec
    [junit] Running org.apache.ivy.plugins.trigger.LogTriggerTest
    [junit] Tests run: 3, Failures: 0, Errors: 0, Skipped: 0, Time elapsed: 1,063 sec
    [junit] Running org.apache.ivy.plugins.version.LatestVersionMatcherTest
    [junit] Tests run: 5, Failures: 0, Errors: 0, Skipped: 0, Time elapsed: 1,399 sec
    [junit] Running org.apache.ivy.plugins.version.PatternVersionMatcherTest
    [junit] Tests run: 3, Failures: 0, Errors: 0, Skipped: 0, Time elapsed: 1,179 sec
    [junit] Running org.apache.ivy.plugins.version.VersionRangeMatcherTest
    [junit] Tests run: 6, Failures: 0, Errors: 0, Skipped: 0, Time elapsed: 1,358 sec
    [junit] Running org.apache.ivy.util.ConfiguratorTest
    [junit] Tests run: 13, Failures: 0, Errors: 0, Skipped: 0, Time elapsed: 0,184 sec
    [junit] Running org.apache.ivy.util.IvyPatternHelperTest
    [junit] Tests run: 7, Failures: 0, Errors: 0, Skipped: 0, Time elapsed: 0,168 sec
    [junit] Running org.apache.ivy.util.StringUtilsTest
    [junit] Tests run: 2, Failures: 0, Errors: 0, Skipped: 0, Time elapsed: 0,208 sec
    [junit] Running org.apache.ivy.util.url.ApacheURLListerTest
    [junit] Tests run: 6, Failures: 0, Errors: 0, Skipped: 0, Time elapsed: 0,531 sec
    [junit] Running org.apache.ivy.util.url.ArtifactoryListingTest
    [junit] Tests run: 1, Failures: 0, Errors: 0, Skipped: 0, Time elapsed: 0,673 sec
    [junit] Running org.apache.ivy.util.url.BasicURLHandlerTest
    [junit] Tests run: 2, Failures: 0, Errors: 0, Skipped: 0, Time elapsed: 30,617 sec
    [junit] Running org.apache.ivy.util.url.HttpclientURLHandlerTest
    [junit] Tests run: 3, Failures: 0, Errors: 0, Skipped: 0, Time elapsed: 2,41 sec
    [junit] Running org.apache.ivy.util.url.IvyAuthenticatorTest
    [junit] Tests run: 1, Failures: 0, Errors: 0, Skipped: 0, Time elapsed: 0,223 sec

test-report:
[junitreport] Processing <https://builds.apache.org/job/Ivy-tests-ubuntu/OS=ubuntu,jdk=JDK%201.7%20(latest)/ws/build/test-report/TESTS-TestSuites.xml>
to /tmp/null356958096
[junitreport] Loading stylesheet jar:file:/home/jenkins/tools/ant/apache-ant-1.9.9/lib/ant-junit.jar!/org/apache/tools/ant/taskdefs/optional/junit/xsl/junit-frames.xsl
[junitreport] Transform time: 2877ms
[junitreport] Deleting: /tmp/null356958096
    [mkdir] Created dir: <https://builds.apache.org/job/Ivy-tests-ubuntu/OS=ubuntu,jdk=JDK%201.7%20(latest)/ws/build/doc/reports/coverage>
[jacoco:report] Loading execution data file <https://builds.apache.org/job/Ivy-tests-ubuntu/OS=ubuntu,jdk=JDK%201.7%20(latest)/ws/build/jacoco.data>
[jacoco:report] Writing bundle 'Ivy' with 679 classes

BUILD FAILED
<https://builds.apache.org/job/Ivy-tests-ubuntu/OS=ubuntu,jdk=JDK%201.7%20(latest)/ws/build.xml>:493:
At least one test has failed. See logs (in <https://builds.apache.org/job/Ivy-tests-ubuntu/OS=ubuntu,jdk=JDK%201.7%20(latest)/ws/build/test-report)>
or report (in <https://builds.apache.org/job/Ivy-tests-ubuntu/OS=ubuntu,jdk=JDK%201.7%20(latest)/ws/build/doc/reports/test)>

Total time: 7 minutes 9 seconds
Build step 'Invoke Ant' marked build as failure
[locks-and-latches] Releasing all the locks
[locks-and-latches] All the locks released
Recording test results

Mime
View raw message