ant-notifications mailing list archives

Site index · List index
Message view « Date » · « Thread »
Top « Date » · « Thread »
From Apache Jenkins Server <jenk...@builds.apache.org>
Subject Build failed in Jenkins: IvyDE-updatesite #798
Date Sat, 01 Jul 2017 21:58:52 GMT
See <https://builds.apache.org/job/IvyDE-updatesite/798/display/redirect>

------------------------------------------
Started by upstream project "Ivy" build number 596
originally caused by:
 Started by an SCM change
 Started by an SCM change
 Started by an SCM change
 Started by an SCM change
 Started by an SCM change
 Started by an SCM change
 Started by an SCM change
 Started by an SCM change
 Started by an SCM change
 Started by an SCM change
 Started by an SCM change
 Started by an SCM change
 Started by an SCM change
Running as hibou
[EnvInject] - Loading node environment variables.
Building remotely on H24 (ubuntu xenial) in workspace <https://builds.apache.org/job/IvyDE-updatesite/ws/>
Updating http://svn.apache.org/repos/asf/ant/ivy/updatesite/trunk at revision '2017-07-01T21:54:56.463
+0000'
Fetching 'https://dist.apache.org/repos/dist/dev/ant/ivyde/updatesite' at -1 into '<https://builds.apache.org/job/IvyDE-updatesite/ws/trunk/dist/dev'>
At revision 20265

Fetching 'https://dist.apache.org/repos/dist/release/ant/ivyde/updatesite' at -1 into '<https://builds.apache.org/job/IvyDE-updatesite/ws/trunk/dist/release'>
At revision 20265

At revision 1800535

No changes for http://svn.apache.org/repos/asf/ant/ivy/updatesite/trunk since the previous
build
No changes for https://dist.apache.org/repos/dist/dev/ant/ivyde/updatesite since the previous
build
No changes for https://dist.apache.org/repos/dist/release/ant/ivyde/updatesite since the previous
build
[locks-and-latches] Checking to see if we really have the locks
[locks-and-latches] Have all the locks, build can start
[trunk] $ /home/jenkins/tools/ant/apache-ant-1.9.9/bin/ant jenkins-prepare
Buildfile: <https://builds.apache.org/job/IvyDE-updatesite/ws/trunk/build.xml>

jenkins-check-download-sdk:

jenkins-get-sdk:

jenkins-check-unzip-eclipse:

jenkins-unzip-eclipse:

jenkins-prepare-eclipse:

jenkins-prepare:

BUILD SUCCESSFUL
Total time: 1 second
[trunk] $ /home/jenkins/tools/ant/apache-ant-1.9.9/bin/ant jenkins-build
Buildfile: <https://builds.apache.org/job/IvyDE-updatesite/ws/trunk/build.xml>

clean:

jenkins-find-ivy-jar:
      [get] Getting: http://builds.apache.org/job/Ivy/lastSuccessfulBuild/artifact/build/artifact/jars/ivy.jar
      [get] To: <https://builds.apache.org/job/IvyDE-updatesite/ws/trunk/dependencies/ivy-jenkins.jar>
      [get] http://builds.apache.org/job/Ivy/lastSuccessfulBuild/artifact/build/artifact/jars/ivy.jar
permanently moved to https://builds.apache.org/job/Ivy/lastSuccessfulBuild/artifact/build/artifact/jars/ivy.jar
      [get] ....................................................
      [get] ....................................................
      [get] ....................................................
      [get] ....................................................
      [get] ....................................................
      [get] ....................................................
      [get] .............................

jenkins-find-ivyde-zip:
      [get] Getting: http://builds.apache.org/job/IvyDE/lastSuccessfulBuild/artifact/dist/version.properties
      [get] To: <https://builds.apache.org/job/IvyDE-updatesite/ws/trunk/dependencies/ivyde-jenkins-version.properties>
      [get] http://builds.apache.org/job/IvyDE/lastSuccessfulBuild/artifact/dist/version.properties
permanently moved to https://builds.apache.org/job/IvyDE/lastSuccessfulBuild/artifact/dist/version.properties
      [get] Error opening connection java.io.FileNotFoundException: https://builds.apache.org/job/IvyDE/lastSuccessfulBuild/artifact/dist/version.properties
      [get] Error opening connection java.io.FileNotFoundException: https://builds.apache.org/job/IvyDE/lastSuccessfulBuild/artifact/dist/version.properties
      [get] Error opening connection java.io.FileNotFoundException: https://builds.apache.org/job/IvyDE/lastSuccessfulBuild/artifact/dist/version.properties
      [get] Can't get http://builds.apache.org/job/IvyDE/lastSuccessfulBuild/artifact/dist/version.properties
to <https://builds.apache.org/job/IvyDE-updatesite/ws/trunk/dependencies/ivyde-jenkins-version.properties>

BUILD FAILED
<https://builds.apache.org/job/IvyDE-updatesite/ws/trunk/build.xml>:467: Can't get http://builds.apache.org/job/IvyDE/lastSuccessfulBuild/artifact/dist/version.properties
to <https://builds.apache.org/job/IvyDE-updatesite/ws/trunk/dependencies/ivyde-jenkins-version.properties>

Total time: 1 second
Build step 'Invoke Ant' marked build as failure
[locks-and-latches] Releasing all the locks
[locks-and-latches] All the locks released
Archiving artifacts

Mime
View raw message