ant-notifications mailing list archives

Site index · List index
Message view « Date » · « Thread »
Top « Date » · « Thread »
From Apache Jenkins Server <jenk...@builds.apache.org>
Subject Build failed in Jenkins: Ivy-tests-Windows » Windows,JDK 1.7 (latest) #2
Date Sun, 25 Jun 2017 12:38:16 GMT
See <https://builds.apache.org/job/Ivy-tests-Windows/OS=Windows,jdk=JDK%201.7%20(latest)/2/display/redirect>

------------------------------------------
[...truncated 2.40 KB...]
No valid HEAD. Skipping the resetting
 > git clean -fdx # timeout=10
Fetching upstream changes from https://git-wip-us.apache.org/repos/asf/ant-ivy.git
 > git fetch --tags --progress https://git-wip-us.apache.org/repos/asf/ant-ivy.git +refs/heads/*:refs/remotes/origin/*
Checking out Revision 80d9b0c380a73c721488f76df30983c7988ccde6 (refs/remotes/origin/master)
 > git config core.sparsecheckout # timeout=10
 > git checkout -f 80d9b0c380a73c721488f76df30983c7988ccde6
First time build. Skipping changelog.
 > git remote # timeout=10
 > git submodule init # timeout=10
 > git submodule sync # timeout=10
 > git config --get remote.origin.url # timeout=10
 > git submodule init # timeout=10
 > git config -f .gitmodules --get-regexp ^submodule\.(.*)\.url # timeout=10
 > git config --get submodule.doc/xooki.url # timeout=10
 > git config -f .gitmodules --get submodule.doc/xooki.path # timeout=10
 > git submodule update --init --recursive doc/xooki
[locks-and-latches] Checking to see if we really have the locks
[locks-and-latches] Have all the locks, build can start
[JDK 1.7 (latest)] $ cmd.exe /C "F:\jenkins\tools\ant\apache-ant-1.9.9\bin\ant.bat '"-Djdk=JDK
1.7 (latest)"' -DOS=Windows clean test-report && exit %%ERRORLEVEL%%"
Buildfile: <https://builds.apache.org/job/Ivy-tests-Windows/OS=Windows,jdk=JDK%201.7%20(latest)/ws/build.xml>

clean:

init:

prepare:
    [mkdir] Created dir: <https://builds.apache.org/job/Ivy-tests-Windows/OS=Windows,jdk=JDK%201.7%20(latest)/ws/build\classes>
    [mkdir] Created dir: <https://builds.apache.org/job/Ivy-tests-Windows/OS=Windows,jdk=JDK%201.7%20(latest)/ws/build\classes\core>
    [mkdir] Created dir: <https://builds.apache.org/job/Ivy-tests-Windows/OS=Windows,jdk=JDK%201.7%20(latest)/ws/build\classes\bootstrap>
    [mkdir] Created dir: <https://builds.apache.org/job/Ivy-tests-Windows/OS=Windows,jdk=JDK%201.7%20(latest)/ws/build\classes\ant>
    [mkdir] Created dir: <https://builds.apache.org/job/Ivy-tests-Windows/OS=Windows,jdk=JDK%201.7%20(latest)/ws/build\classes\optional>
    [mkdir] Created dir: <https://builds.apache.org/job/Ivy-tests-Windows/OS=Windows,jdk=JDK%201.7%20(latest)/ws/build\classes\all>
    [mkdir] Created dir: <https://builds.apache.org/job/Ivy-tests-Windows/OS=Windows,jdk=JDK%201.7%20(latest)/ws/build\test>
    [mkdir] Created dir: <https://builds.apache.org/job/Ivy-tests-Windows/OS=Windows,jdk=JDK%201.7%20(latest)/ws/build\artifact>
    [mkdir] Created dir: <https://builds.apache.org/job/Ivy-tests-Windows/OS=Windows,jdk=JDK%201.7%20(latest)/ws/build\doc\reports\test>

compile-core:
    [javac] Compiling 408 source files to <https://builds.apache.org/job/Ivy-tests-Windows/OS=Windows,jdk=JDK%201.7%20(latest)/ws/build\classes\core>
    [javac] Note: <https://builds.apache.org/job/Ivy-tests-Windows/OS=Windows,jdk=JDK%201.7%20(latest)/ws/src\java\org\apache\ivy\core\cache\DefaultRepositoryCacheManager.java>
uses or overrides a deprecated API.
    [javac] Note: Recompile with -Xlint:deprecation for details.
    [javac] Note: Some input files use unchecked or unsafe operations.
    [javac] Note: Recompile with -Xlint:unchecked for details.
     [copy] Copying 25 files to <https://builds.apache.org/job/Ivy-tests-Windows/OS=Windows,jdk=JDK%201.7%20(latest)/ws/build\classes\core>
     [copy] Copying 1 file to <https://builds.apache.org/job/Ivy-tests-Windows/OS=Windows,jdk=JDK%201.7%20(latest)/ws/build\classes\core\org\apache\ivy\core\settings>
     [copy] Copying 1 file to <https://builds.apache.org/job/Ivy-tests-Windows/OS=Windows,jdk=JDK%201.7%20(latest)/ws/build\classes\core\org\apache\ivy\core\settings>
     [copy] Copying 1 file to <https://builds.apache.org/job/Ivy-tests-Windows/OS=Windows,jdk=JDK%201.7%20(latest)/ws/build\classes\core\org\apache\ivy\core\settings>
     [copy] Copying 1 file to <https://builds.apache.org/job/Ivy-tests-Windows/OS=Windows,jdk=JDK%201.7%20(latest)/ws/build\classes\core\org\apache\ivy\core\settings>
     [copy] Copying 1 file to <https://builds.apache.org/job/Ivy-tests-Windows/OS=Windows,jdk=JDK%201.7%20(latest)/ws/build\classes\core\org\apache\ivy\core\settings>
     [copy] Copying 1 file to <https://builds.apache.org/job/Ivy-tests-Windows/OS=Windows,jdk=JDK%201.7%20(latest)/ws/build\classes\core\org\apache\ivy\core\settings>

compile-bootstrap:
    [javac] Compiling 49 source files to <https://builds.apache.org/job/Ivy-tests-Windows/OS=Windows,jdk=JDK%201.7%20(latest)/ws/build\classes\bootstrap>
    [javac] Note: Some input files use unchecked or unsafe operations.
    [javac] Note: Recompile with -Xlint:unchecked for details.
     [copy] Copying 1 file to <https://builds.apache.org/job/Ivy-tests-Windows/OS=Windows,jdk=JDK%201.7%20(latest)/ws/build\classes\bootstrap>

init-ivy-user-home:

init-ivy-local-home:

init-ivy-home:

init-ivy:
[ivy:configure] impossible to define new type: class not found: org.apache.ivy.plugins.resolver.SshResolver
in [] nor Ivy classloader
[ivy:configure] impossible to define new type: class not found: org.apache.ivy.plugins.resolver.VsftpResolver
in [] nor Ivy classloader
[ivy:configure] impossible to define new type: class not found: org.apache.ivy.plugins.signer.bouncycastle.OpenPGPSignatureGenerator
in [] nor Ivy classloader
[ivy:configure] impossible to define new type: class not found: org.apache.ivy.plugins.resolver.SFTPResolver
in [] nor Ivy classloader
[ivy:configure] impossible to define new type: class not found: org.apache.ivy.plugins.resolver.packager.PackagerResolver
in [] nor Ivy classloader
[ivy:configure] impossible to define new type: class not found: org.apache.ivy.plugins.resolver.VfsResolver
in [] nor Ivy classloader
[ivy:configure] impossible to define glob matcher: org.apache.ivy.plugins.matcher.GlobPatternMatcher
was not found (java.lang.ClassNotFoundException: org.apache.ivy.plugins.matcher.GlobPatternMatcher)
[ivy:configure] :: Apache Ivy non official version -  :: http://ant.apache.org/ivy/ ::
[ivy:configure] :: loading settings :: url = <https://builds.apache.org/job/Ivy-tests-Windows/OS=Windows,jdk=JDK%201.7%20(latest)/ws/build/classes/core/org/apache/ivy/core/settings/ivysettings.xml>

resolve:
[ivy:retrieve] :: resolving dependencies :: org.apache.ivy#ivy;working@je-win2012-3
[ivy:retrieve] 	confs: [default, test]
[ivy:retrieve] 	found org.apache.ant#ant;1.9.9 in public
[ivy:retrieve] 	found org.apache.ant#ant-launcher;1.9.9 in public
[ivy:retrieve] 	found commons-httpclient#commons-httpclient;3.1 in public
[ivy:retrieve] 	found commons-logging#commons-logging;1.0.4 in public
[ivy:retrieve] 	found commons-codec#commons-codec;1.2 in public
[ivy:retrieve] 	found oro#oro;2.0.8 in public
[ivy:retrieve] 	found commons-vfs#commons-vfs;1.0 in public
[ivy:retrieve] 	found com.jcraft#jsch;0.1.54 in public
[ivy:retrieve] 	found com.jcraft#jsch.agentproxy;0.0.9 in public
[ivy:retrieve] 	found com.jcraft#jsch.agentproxy.connector-factory;0.0.9 in public
[ivy:retrieve] 	found com.jcraft#jsch.agentproxy.core;0.0.9 in public
[ivy:retrieve] 	found com.jcraft#jsch.agentproxy.usocket-jna;0.0.9 in public
[ivy:retrieve] 	found net.java.dev.jna#jna;4.1.0 in public
[ivy:retrieve] 	found net.java.dev.jna#jna-platform;4.1.0 in public
[ivy:retrieve] 	found com.jcraft#jsch.agentproxy.usocket-nc;0.0.9 in public
[ivy:retrieve] 	found com.jcraft#jsch.agentproxy.sshagent;0.0.9 in public
[ivy:retrieve] 	found com.jcraft#jsch.agentproxy.pageant;0.0.9 in public
[ivy:retrieve] 	found com.jcraft#jsch.agentproxy.jsch;0.0.9 in public
[ivy:retrieve] 	found org.bouncycastle#bcpg-jdk15on;1.52 in public
[ivy:retrieve] 	found org.bouncycastle#bcprov-jdk15on;1.52 in public
[ivy:retrieve] 	found junit#junit;4.12 in public
[ivy:retrieve] 	found org.hamcrest#hamcrest-core;1.3 in public
[ivy:retrieve] 	found org.apache.ant#ant-testutil;1.9.9 in public
[ivy:retrieve] 	found ant-contrib#ant-contrib;1.0b3 in public
[ivy:retrieve] 	found xmlunit#xmlunit;1.6 in public
[ivy:retrieve] downloading https://repo1.maven.org/maven2/org/apache/ant/ant/1.9.9/ant-1.9.9.jar
...
[ivy:retrieve] .........................................................................................................................................
(1999kB)
[ivy:retrieve] .. (0kB)
[ivy:retrieve] 	[SUCCESSFUL ] org.apache.ant#ant;1.9.9!ant.jar (78ms)
[ivy:retrieve] downloading https://repo1.maven.org/maven2/commons-httpclient/commons-httpclient/3.1/commons-httpclient-3.1.jar
...
[ivy:retrieve] .............................. (297kB)
[ivy:retrieve] .. (0kB)
[ivy:retrieve] 	[SUCCESSFUL ] commons-httpclient#commons-httpclient;3.1!commons-httpclient.jar
(31ms)
[ivy:retrieve] downloading https://repo1.maven.org/maven2/oro/oro/2.0.8/oro-2.0.8.jar ...
[ivy:retrieve] ................ (63kB)
[ivy:retrieve] .. (0kB)
[ivy:retrieve] 	[SUCCESSFUL ] oro#oro;2.0.8!oro.jar (0ms)
[ivy:retrieve] downloading https://repo1.maven.org/maven2/commons-vfs/commons-vfs/1.0/commons-vfs-1.0.jar
...
[ivy:retrieve] .................................. (354kB)
[ivy:retrieve] .. (0kB)
[ivy:retrieve] 	[SUCCESSFUL ] commons-vfs#commons-vfs;1.0!commons-vfs.jar (15ms)
[ivy:retrieve] downloading https://repo1.maven.org/maven2/com/jcraft/jsch/0.1.54/jsch-0.1.54.jar
...
[ivy:retrieve] ............................. (273kB)
[ivy:retrieve] .. (0kB)
[ivy:retrieve] 	[SUCCESSFUL ] com.jcraft#jsch;0.1.54!jsch.jar (16ms)
[ivy:retrieve] downloading https://repo1.maven.org/maven2/com/jcraft/jsch.agentproxy.connector-factory/0.0.9/jsch.agentproxy.connector-factory-0.0.9.jar
...
[ivy:retrieve] ...... (11kB)
[ivy:retrieve] .. (0kB)
[ivy:retrieve] 	[SUCCESSFUL ] com.jcraft#jsch.agentproxy.connector-factory;0.0.9!jsch.agentproxy.connector-factory.jar(bundle)
(0ms)
[ivy:retrieve] downloading https://repo1.maven.org/maven2/com/jcraft/jsch.agentproxy.jsch/0.0.9/jsch.agentproxy.jsch-0.0.9.jar
...
[ivy:retrieve] ... (4kB)
[ivy:retrieve] .. (0kB)
[ivy:retrieve] 	[SUCCESSFUL ] com.jcraft#jsch.agentproxy.jsch;0.0.9!jsch.agentproxy.jsch.jar
(15ms)
[ivy:retrieve] downloading https://repo1.maven.org/maven2/org/bouncycastle/bcpg-jdk15on/1.52/bcpg-jdk15on-1.52.jar
...
[ivy:retrieve] ............................ (267kB)
[ivy:retrieve] .. (0kB)
[ivy:retrieve] 	[SUCCESSFUL ] org.bouncycastle#bcpg-jdk15on;1.52!bcpg-jdk15on.jar (31ms)
[ivy:retrieve] downloading https://repo1.maven.org/maven2/org/bouncycastle/bcprov-jdk15on/1.52/bcprov-jdk15on-1.52.jar
...
[ivy:retrieve] .............................................................................................................................................................................................
(2834kB)
[ivy:retrieve] .. (0kB)
[ivy:retrieve] 	[SUCCESSFUL ] org.bouncycastle#bcprov-jdk15on;1.52!bcprov-jdk15on.jar (110ms)
[ivy:retrieve] downloading https://repo1.maven.org/maven2/org/apache/ant/ant-launcher/1.9.9/ant-launcher-1.9.9.jar
...
[ivy:retrieve] ........ (17kB)
[ivy:retrieve] .. (0kB)
[ivy:retrieve] 	[SUCCESSFUL ] org.apache.ant#ant-launcher;1.9.9!ant-launcher.jar (15ms)
[ivy:retrieve] downloading https://repo1.maven.org/maven2/commons-logging/commons-logging/1.0.4/commons-logging-1.0.4.jar
...
[ivy:retrieve] ................ (37kB)
[ivy:retrieve] .. (0kB)
[ivy:retrieve] 	[SUCCESSFUL ] commons-logging#commons-logging;1.0.4!commons-logging.jar (16ms)
[ivy:retrieve] downloading https://repo1.maven.org/maven2/commons-codec/commons-codec/1.2/commons-codec-1.2.jar
...
[ivy:retrieve] ............. (29kB)
[ivy:retrieve] .. (0kB)
[ivy:retrieve] 	[SUCCESSFUL ] commons-codec#commons-codec;1.2!commons-codec.jar (16ms)
[ivy:retrieve] downloading https://repo1.maven.org/maven2/com/jcraft/jsch.agentproxy.core/0.0.9/jsch.agentproxy.core-0.0.9.jar
...
[ivy:retrieve] ..... (9kB)
[ivy:retrieve] .. (0kB)
[ivy:retrieve] 	[SUCCESSFUL ] com.jcraft#jsch.agentproxy.core;0.0.9!jsch.agentproxy.core.jar(bundle)
(0ms)
[ivy:retrieve] downloading https://repo1.maven.org/maven2/com/jcraft/jsch.agentproxy.usocket-jna/0.0.9/jsch.agentproxy.usocket-jna-0.0.9.jar
...
[ivy:retrieve] .... (6kB)
[ivy:retrieve] .. (0kB)
[ivy:retrieve] 	[SUCCESSFUL ] com.jcraft#jsch.agentproxy.usocket-jna;0.0.9!jsch.agentproxy.usocket-jna.jar(bundle)
(0ms)
[ivy:retrieve] downloading https://repo1.maven.org/maven2/com/jcraft/jsch.agentproxy.usocket-nc/0.0.9/jsch.agentproxy.usocket-nc-0.0.9.jar
...
[ivy:retrieve] .... (5kB)
[ivy:retrieve] .. (0kB)
[ivy:retrieve] 	[SUCCESSFUL ] com.jcraft#jsch.agentproxy.usocket-nc;0.0.9!jsch.agentproxy.usocket-nc.jar(bundle)
(16ms)
[ivy:retrieve] downloading https://repo1.maven.org/maven2/com/jcraft/jsch.agentproxy.sshagent/0.0.9/jsch.agentproxy.sshagent-0.0.9.jar
...
[ivy:retrieve] ... (4kB)
[ivy:retrieve] .. (0kB)
[ivy:retrieve] 	[SUCCESSFUL ] com.jcraft#jsch.agentproxy.sshagent;0.0.9!jsch.agentproxy.sshagent.jar(bundle)
(16ms)
[ivy:retrieve] downloading https://repo1.maven.org/maven2/com/jcraft/jsch.agentproxy.pageant/0.0.9/jsch.agentproxy.pageant-0.0.9.jar
...
[ivy:retrieve] ..... (7kB)
[ivy:retrieve] .. (0kB)
[ivy:retrieve] 	[SUCCESSFUL ] com.jcraft#jsch.agentproxy.pageant;0.0.9!jsch.agentproxy.pageant.jar(bundle)
(31ms)
[ivy:retrieve] downloading https://repo1.maven.org/maven2/net/java/dev/jna/jna/4.1.0/jna-4.1.0.jar
...
[ivy:retrieve] ................................................................... (893kB)
[ivy:retrieve] .. (0kB)
[ivy:retrieve] 	[SUCCESSFUL ] net.java.dev.jna#jna;4.1.0!jna.jar (31ms)
[ivy:retrieve] downloading https://repo1.maven.org/maven2/net/java/dev/jna/jna-platform/4.1.0/jna-platform-4.1.0.jar
...
[ivy:retrieve] .....................................................................................................
(1430kB)
[ivy:retrieve] .. (0kB)
[ivy:retrieve] 	[SUCCESSFUL ] net.java.dev.jna#jna-platform;4.1.0!jna-platform.jar (47ms)
[ivy:retrieve] downloading https://repo1.maven.org/maven2/junit/junit/4.12/junit-4.12.jar
...
[ivy:retrieve] ............................... (307kB)
[ivy:retrieve] .. (0kB)
[ivy:retrieve] 	[SUCCESSFUL ] junit#junit;4.12!junit.jar (15ms)
[ivy:retrieve] downloading https://repo1.maven.org/maven2/org/hamcrest/hamcrest-core/1.3/hamcrest-core-1.3.jar
...
[ivy:retrieve] .............. (43kB)
[ivy:retrieve] .. (0kB)
[ivy:retrieve] 	[SUCCESSFUL ] org.hamcrest#hamcrest-core;1.3!hamcrest-core.jar (16ms)
[ivy:retrieve] downloading https://repo1.maven.org/maven2/org/apache/ant/ant-testutil/1.9.9/ant-testutil-1.9.9.jar
...
[ivy:retrieve] ............ (26kB)
[ivy:retrieve] .. (0kB)
[ivy:retrieve] 	[SUCCESSFUL ] org.apache.ant#ant-testutil;1.9.9!ant-testutil.jar (94ms)
[ivy:retrieve] downloading https://repo1.maven.org/maven2/ant-contrib/ant-contrib/1.0b3/ant-contrib-1.0b3.jar
...
[ivy:retrieve] ......................... (219kB)
[ivy:retrieve] .. (0kB)
[ivy:retrieve] 	[SUCCESSFUL ] ant-contrib#ant-contrib;1.0b3!ant-contrib.jar (15ms)
[ivy:retrieve] downloading https://repo1.maven.org/maven2/xmlunit/xmlunit/1.6/xmlunit-1.6.jar
...
[ivy:retrieve] .................. (98kB)
[ivy:retrieve] .. (0kB)
[ivy:retrieve] 	[SUCCESSFUL ] xmlunit#xmlunit;1.6!xmlunit.jar (16ms)
[ivy:retrieve] :: resolution report :: resolve 4531ms :: artifacts dl 719ms
[ivy:retrieve] 	:: evicted modules:
[ivy:retrieve] 	com.jcraft#jsch;0.1.49 by [com.jcraft#jsch;0.1.54] in [default]
	---------------------------------------------------------------------
	|                  |            modules            ||   artifacts   |
	|       conf       | number| search|dwnlded|evicted|| number|dwnlded|
	---------------------------------------------------------------------
	|      default     |   21  |   20  |   20  |   1   ||   19  |   19  |
	|       test       |   6   |   6   |   6   |   0   ||   6   |   6   |
	---------------------------------------------------------------------
[ivy:retrieve] :: retrieving :: org.apache.ivy#ivy [sync]
[ivy:retrieve] 	confs: [default, test]

BUILD FAILED
<https://builds.apache.org/job/Ivy-tests-Windows/OS=Windows,jdk=JDK%201.7%20(latest)/ws/build.xml>:184:
impossible to ivy retrieve: java.lang.RuntimeException: problem during retrieve of org.apache.ivy#ivy:
java.io.FileNotFoundException: \:\:\jenkins\jenkins-slave\workspace\Ivy-tests-Windows\OS\Windows\jdk\JDK
1.7 (latest)\lib\jsch.jar (The filename, directory name, or volume label syntax is incorrect)
	at org.apache.ivy.core.retrieve.RetrieveEngine.retrieve(RetrieveEngine.java:256)
	at org.apache.ivy.Ivy.retrieve(Ivy.java:561)
	at org.apache.ivy.ant.IvyRetrieve.doExecute(IvyRetrieve.java:98)
	at org.apache.ivy.ant.IvyTask.execute(IvyTask.java:272)
	at org.apache.tools.ant.UnknownElement.execute(UnknownElement.java:293)
	at sun.reflect.GeneratedMethodAccessor4.invoke(Unknown Source)
	at sun.reflect.DelegatingMethodAccessorImpl.invoke(DelegatingMethodAccessorImpl.java:43)
	at java.lang.reflect.Method.invoke(Method.java:606)
	at org.apache.tools.ant.dispatch.DispatchUtils.execute(DispatchUtils.java:106)
	at org.apache.tools.ant.Task.perform(Task.java:348)
	at org.apache.tools.ant.Target.execute(Target.java:435)
	at org.apache.tools.ant.Target.performTasks(Target.java:456)
	at org.apache.tools.ant.Project.executeSortedTargets(Project.java:1405)
	at org.apache.tools.ant.Project.executeTarget(Project.java:1376)
	at org.apache.tools.ant.helper.DefaultExecutor.executeTargets(DefaultExecutor.java:41)
	at org.apache.tools.ant.Project.executeTargets(Project.java:1260)
	at org.apache.tools.ant.Main.runBuild(Main.java:857)
	at org.apache.tools.ant.Main.startAnt(Main.java:236)
	at org.apache.tools.ant.launch.Launcher.run(Launcher.java:287)
	at org.apache.tools.ant.launch.Launcher.main(Launcher.java:113)
Caused by: java.io.FileNotFoundException: \:\:\jenkins\jenkins-slave\workspace\Ivy-tests-Windows\OS\Windows\jdk\JDK
1.7 (latest)\lib\jsch.jar (The filename, directory name, or volume label syntax is incorrect)
	at java.io.FileOutputStream.open(Native Method)
	at java.io.FileOutputStream.<init>(FileOutputStream.java:221)
	at java.io.FileOutputStream.<init>(FileOutputStream.java:171)
	at org.apache.ivy.util.FileUtil.copy(FileUtil.java:286)
	at org.apache.ivy.util.FileUtil.copy(FileUtil.java:217)
	at org.apache.ivy.core.retrieve.RetrieveEngine.retrieve(RetrieveEngine.java:177)
	... 19 more

Total time: 15 seconds
Build step 'Invoke Ant' marked build as failure
[locks-and-latches] Releasing all the locks
[locks-and-latches] All the locks released
Recording test results
ERROR: Step ‘Publish JUnit test result report’ failed: No test report files were found.
Configuration error?


Mime
View raw message