ant-notifications mailing list archives

Site index · List index
Message view « Date » · « Thread »
Top « Date » · « Thread »
From Apache Jenkins Server <jenk...@builds.apache.org>
Subject Build failed in Jenkins: AntLib-compress #26
Date Sat, 06 May 2017 18:01:28 GMT
See <https://builds.apache.org/job/AntLib-compress/26/display/redirect>

------------------------------------------
[...truncated 73.15 KB...]
[au:antunit] Target: test-refid-check-encoding took 0.003 sec
[au:antunit] Target: test-refid-modify took 0.031 sec
[au:antunit] Target: testSevenZSource took 0.01 sec
[au:antunit] Target: test-refid-check-prefix took 0.003 sec
[au:antunit] Target: testMissingArchiveDoesntMatter took 0.003 sec
[au:antunit] Build File: <https://builds.apache.org/job/AntLib-compress/ws/src/tests/antunit/snappyresource-test.xml>
[au:antunit] Tests run: 2, Failures: 0, Errors: 0, Time elapsed: 0.023 sec
[au:antunit] Target: testNativeSnappyUnframed took 0.008 sec
[au:antunit] Target: testNativeSnappy took 0.009 sec
[au:antunit] Build File: <https://builds.apache.org/job/AntLib-compress/ws/src/tests/antunit/tar-test.xml>
[au:antunit] Tests run: 38, Failures: 2, Errors: 0, Time elapsed: 32.755 sec
[au:antunit] Target: testNonFileDest took 0.011 sec
[au:antunit] Target: testPaxLongFile took 0.02 sec
[au:antunit] Target: testPrefixWithoutSlash took 0.018 sec
[au:antunit] Target: testCreateOfUpToDate took 4.014 sec
[au:antunit] Target: testExplicitUstarLongFile took 0.01 sec
[au:antunit] Target: testArFileSet took 0.022 sec
[au:antunit] Target: testCpioFileSet took 0.019 sec
[au:antunit] Target: testPreserveDuplicates took 0.005 sec
[au:antunit] Target: testFailEmpty took 0.004 sec
[au:antunit] Target: testCoreTarFileSet took 0.016 sec
[au:antunit] Target: testPreserveLeadingSlashes took 0.014 sec
[au:antunit] Target: testAntlibZipFileSet  FAILED
[au:antunit] 	at line 39, column 24
[au:antunit] 	Message: Assertion failed
[au:antunit] 	took 0.014 sec
[au:antunit] Target: testPrefixWithBackslash took 0.013 sec
[au:antunit] Target: testImplicitDirectoriesUsePermissions took 0.005 sec
[au:antunit] Target: testReplaceOfOutOfDate took 4.036 sec
[au:antunit] Target: testUpdateOfUpToDate took 4.012 sec
[au:antunit] Target: testUpdateOfOutOfDate took 4.035 sec
[au:antunit] Target: testImplicitUstarLongFile took 0.007 sec
[au:antunit] Target: testSkipEmpty took 0.005 sec
[au:antunit] Target: testWithDirectories took 0.018 sec
[au:antunit] Target: testFullpath took 0.016 sec
[au:antunit] Target: testPreserve0Permissions took 0.016 sec
[au:antunit] Target: testForceCreateOfUpToDate took 4.028 sec
[au:antunit] Target: testNoDirectoriesByDefault took 0.019 sec
[au:antunit] Target: testPlainFileSet took 0.018 sec
[au:antunit] Target: testReplaceOfUpToDate took 4.012 sec
[au:antunit] Target: testCoreZipFileSet  FAILED
[au:antunit] 	at line 39, column 24
[au:antunit] 	Message: Assertion failed
[au:antunit] 	took 0.023 sec
[au:antunit] Target: testAntlibTarFileSet took 0.021 sec
[au:antunit] Target: testCreateOfOutOfDate took 4.03 sec
[au:antunit] Target: testFileSetPermissionsWin took 0.021 sec
[au:antunit] Target: testOldgnuLongFile took 0.018 sec
[au:antunit] Target: testAddDuplicates took 0.006 sec
[au:antunit] Target: testRemoveLeadingSlashes took 0.013 sec
[au:antunit] Target: testPrefixWithSlash took 0.013 sec
[au:antunit] Target: testWithImplicitDirectories took 0.012 sec
[au:antunit] Target: testForceReplaceOfUpToDate took 4.028 sec
[au:antunit] Target: test0PermissionsGetReplaced took 0.021 sec
[au:antunit] Target: testFailDuplicates took 0.005 sec
[au:antunit] Build File: <https://builds.apache.org/job/AntLib-compress/ws/src/tests/antunit/tarentry-test.xml>
[au:antunit] Tests run: 3, Failures: 0, Errors: 0, Time elapsed: 0.03 sec
[au:antunit] Target: testResourceProperties took 0.017 sec
[au:antunit] Target: testUncompressSource took 0.005 sec
[au:antunit] Target: testTarSource took 0.004 sec
[au:antunit] Build File: <https://builds.apache.org/job/AntLib-compress/ws/src/tests/antunit/tarfileset-test.xml>
[au:antunit] Tests run: 5, Failures: 0, Errors: 0, Time elapsed: 0.027 sec
[au:antunit] Target: testMissingArchive took 0.005 sec
[au:antunit] Target: testUncompressSource took 0.006 sec
[au:antunit] Target: testTarSource took 0.003 sec
[au:antunit] Target: test-refid-check-encoding took 0.002 sec
[au:antunit] Target: testMissingArchiveDoesntMatter took 0.003 sec
[au:antunit] Build File: <https://builds.apache.org/job/AntLib-compress/ws/src/tests/antunit/un7z-test.xml>
[au:antunit] Tests run: 7, Failures: 0, Errors: 0, Time elapsed: 0.135 sec
[au:antunit] Target: testAgainstAntlib7zTask took 0.034 sec
[au:antunit] Target: testAgainstAntlib7zTaskDeltaPlusLZMA2 took 0.025 sec
[au:antunit] Target: testAgainstAntlib7zTaskBZIP2 took 0.016 sec
[au:antunit] Target: testAgainstAntlib7zTaskDeflate took 0.005 sec
[au:antunit] Target: testAgainstNative7z took 0.011 sec
[au:antunit] Target: testAgainstAntlib7zTaskLZMA2 took 0.023 sec
[au:antunit] Target: testAgainstAntlib7zTaskCopy took 0.004 sec
[au:antunit] Build File: <https://builds.apache.org/job/AntLib-compress/ws/src/tests/antunit/unar-test.xml>
[au:antunit] Tests run: 2, Failures: 0, Errors: 0, Time elapsed: 0.011 sec
[au:antunit] Target: testAgainstNativeAr took 0.004 sec
[au:antunit] Target: testAgainstAntlibArTask took 0.004 sec
[au:antunit] Build File: <https://builds.apache.org/job/AntLib-compress/ws/src/tests/antunit/unarj-test.xml>
[au:antunit] Tests run: 2, Failures: 0, Errors: 0, Time elapsed: 0.016 sec
[au:antunit] Target: testResourceCollection took 0.01 sec
[au:antunit] Target: testAgainstNativeArj took 0.004 sec
[au:antunit] Build File: <https://builds.apache.org/job/AntLib-compress/ws/src/tests/antunit/uncpio-test.xml>
[au:antunit] Tests run: 8, Failures: 0, Errors: 0, Time elapsed: 0.096 sec
[au:antunit] Target: testAgainstNativeCpioBinary took 0.004 sec
[au:antunit] Target: testAgainstNativeCpioCRC took 0.004 sec
[au:antunit] Target: testAgainstAntlibCpioTaskBinary took 0.021 sec
[au:antunit] Target: testAgainstAntlibCpioTaskOldAscii took 0.018 sec
[au:antunit] Target: testAgainstNativeCpioOldAscii took 0.003 sec
[au:antunit] Target: testAgainstNativeCpioNewAscii took 0.003 sec
[au:antunit] Target: testResourceCollection took 0.01 sec
[au:antunit] Target: testAgainstAntlibCpioTaskNewAscii took 0.015 sec
[au:antunit] Build File: <https://builds.apache.org/job/AntLib-compress/ws/src/tests/antunit/undump-test.xml>
[au:antunit] Tests run: 3, Failures: 0, Errors: 0, Time elapsed: 0.025 sec
[au:antunit] Target: testAgainstNativeDump took 0.005 sec
[au:antunit] Target: testResourceCollection took 0.011 sec
[au:antunit] Target: testAgainstNativeDumpCompressed took 0.004 sec
[au:antunit] Build File: <https://builds.apache.org/job/AntLib-compress/ws/src/tests/antunit/unlzma-test.xml>
[au:antunit] Tests run: 4, Failures: 0, Errors: 0, Time elapsed: 0.027 sec
[au:antunit] Target: test2 took 0.004 sec
[au:antunit] Target: test1 took 0.003 sec
[au:antunit] Target: testNativeLZMA took 0.005 sec
[au:antunit] Target: testWithResource took 0.004 sec
[au:antunit] Build File: <https://builds.apache.org/job/AntLib-compress/ws/src/tests/antunit/unpack200-test.xml>
[au:antunit] Tests run: 5, Failures: 0, Errors: 0, Time elapsed: 0.18 sec
[au:antunit] Target: testAgainstNativePack200 took 0.049 sec
[au:antunit] Target: testAgainstPack200Task took 0.031 sec
[au:antunit] Target: testProperties took 0.031 sec
[au:antunit] Target: testDoesntSupportConcatenatedStreams took 0.028 sec
[au:antunit] Target: testTempFileStrategy took 0.03 sec
[au:antunit] Build File: <https://builds.apache.org/job/AntLib-compress/ws/src/tests/antunit/unsnappy-test.xml>
[au:antunit] Tests run: 6, Failures: 0, Errors: 0, Time elapsed: 0.037 sec
[au:antunit] Target: test2 took 0.003 sec
[au:antunit] Target: test1 took 0.002 sec
[au:antunit] Target: testNativeSnappy took 0.004 sec
[au:antunit] Target: testNativeSnappyUnframed took 0.003 sec
[au:antunit] Target: testWithResource took 0.004 sec
[au:antunit] Target: testWithResourceUnframed took 0.003 sec
[au:antunit] Build File: <https://builds.apache.org/job/AntLib-compress/ws/src/tests/antunit/untar-test.xml>
[au:antunit] Tests run: 4, Failures: 0, Errors: 0, Time elapsed: 0.064 sec
[au:antunit] Target: testAgainstAntlibTarTask took 0.021 sec
[au:antunit] Target: testAgainstCoreTarTask took 0.024 sec
[au:antunit] Target: testResourceCollection took 0.006 sec
[au:antunit] Target: testAgainstNativeTar took 0.004 sec
[au:antunit] Build File: <https://builds.apache.org/job/AntLib-compress/ws/src/tests/antunit/unxz-test.xml>
[au:antunit] Tests run: 8, Failures: 0, Errors: 0, Time elapsed: 0.103 sec
[au:antunit] Target: test2 took 0.005 sec
[au:antunit] Target: test1 took 0.003 sec
[au:antunit] Target: testXZTask took 0.036 sec
[au:antunit] Target: testConcatenatedStreamsAllStreams took 0.008 sec
[au:antunit] Target: testNativeXZ took 0.007 sec
[au:antunit] Target: testWithResource took 0.007 sec
[au:antunit] Target: testConcatenatedStreamsOnlyFirstStream took 0.006 sec
[au:antunit] Target: testConcatenatedStreamsDefault took 0.006 sec
[au:antunit] Build File: <https://builds.apache.org/job/AntLib-compress/ws/src/tests/antunit/unz-test.xml>
[au:antunit] Tests run: 4, Failures: 0, Errors: 0, Time elapsed: 0.031 sec
[au:antunit] Target: test2 took 0.004 sec
[au:antunit] Target: test1 took 0.003 sec
[au:antunit] Target: testNativeZ took 0.009 sec
[au:antunit] Target: testWithResource took 0.005 sec
[au:antunit] Build File: <https://builds.apache.org/job/AntLib-compress/ws/src/tests/antunit/unzip-test.xml>
[au:antunit] Tests run: 7, Failures: 0, Errors: 0, Time elapsed: 0.11 sec
[au:antunit] Target: testSkipUnreadableEntries took 0.005 sec
[au:antunit] Target: testAgainstAntlibZipTask took 0.029 sec
[au:antunit] Target: testStrippingOfPathsep took 0.005 sec
[au:antunit] Target: testAgainstNativeZip took 0.004 sec
[au:antunit] Target: testAgainstCoreZipTask took 0.041 sec
[au:antunit] Target: testResourceCollection took 0.007 sec
[au:antunit] Target: testFailsOnUnreadableEntries took 0.005 sec
[au:antunit] Build File: <https://builds.apache.org/job/AntLib-compress/ws/src/tests/antunit/xz-test.xml>
[au:antunit] Tests run: 8, Failures: 0, Errors: 0, Time elapsed: 0.282 sec
[au:antunit] Target: testDateCheck took 0.005 sec
[au:antunit] Target: testFailTwo took 0.004 sec
[au:antunit] Target: testRealTestWithResource took 0.025 sec
[au:antunit] Target: testFailTwoDests took 0.004 sec
[au:antunit] Target: testFailNoDest took 0.003 sec
[au:antunit] Target: testFailNone took 0.003 sec
[au:antunit] Target: testNestedTask took 0.037 sec
[au:antunit] Target: testRealTest took 0.174 sec
[au:antunit] Build File: <https://builds.apache.org/job/AntLib-compress/ws/src/tests/antunit/xzresource-test.xml>
[au:antunit] Tests run: 4, Failures: 0, Errors: 0, Time elapsed: 0.051 sec
[au:antunit] Target: testConcatenatedStreamsAllStreams took 0.013 sec
[au:antunit] Target: testNativeXZ took 0.009 sec
[au:antunit] Target: testConcatenatedStreamsOnlyFirstStream took 0.007 sec
[au:antunit] Target: testConcatenatedStreamsDefault took 0.007 sec
[au:antunit] Build File: <https://builds.apache.org/job/AntLib-compress/ws/src/tests/antunit/zip-test.xml>
[au:antunit] Tests run: 39, Failures: 2, Errors: 0, Time elapsed: 74.99 sec
[au:antunit] Target: testNonFileDest took 0.008 sec
[au:antunit] Target: testPrefixWithoutSlash took 0.016 sec
[au:antunit] Target: testBigArchiveWithZip64 took 42.211 sec
[au:antunit] Target: testCreateOfUpToDate took 4.015 sec
[au:antunit] Target: testBigArchiveWithoutZip64 took 0.008 sec
[au:antunit] Target: testArFileSet took 0.024 sec
[au:antunit] Target: testCpioFileSet took 0.02 sec
[au:antunit] Target: testPreserveDuplicates took 0.006 sec
[au:antunit] Target: testFailEmpty took 0.005 sec
[au:antunit] Target: testCoreTarFileSet took 0.016 sec
[au:antunit] Target: testPreserveLeadingSlashes took 0.015 sec
[au:antunit] Target: testAntlibZipFileSet  FAILED
[au:antunit] 	at line 35, column 24
[au:antunit] 	Message: Assertion failed
[au:antunit] 	took 0.015 sec
[au:antunit] Target: testComment took 0.004 sec
[au:antunit] Target: testPrefixWithBackslash took 0.014 sec
[au:antunit] Target: testLevel took 0.009 sec
[au:antunit] Target: testImplicitDirectoriesUsePermissions took 0.006 sec
[au:antunit] Target: testReplaceOfOutOfDate took 4.036 sec
[au:antunit] Target: testRoundDown took 0.02 sec
[au:antunit] Target: testUpdateOfUpToDate took 4.014 sec
[au:antunit] Target: testUpdateOfOutOfDate took 4.04 sec
[au:antunit] Target: testSkipEmpty took 0.006 sec
[au:antunit] Target: testWithDirectories took 0.019 sec
[au:antunit] Target: testFullpath took 0.016 sec
[au:antunit] Target: testPreserve0Permissions took 0.017 sec
[au:antunit] Target: testForceCreateOfUpToDate took 4.028 sec
[au:antunit] Target: testNoDirectoriesByDefault took 0.02 sec
[au:antunit] Target: testPlainFileSet took 0.017 sec
[au:antunit] Target: testReplaceOfUpToDate took 4.015 sec
[au:antunit] Target: testCoreZipFileSet  FAILED
[au:antunit] 	at line 35, column 24
[au:antunit] 	Message: Assertion failed
[au:antunit] 	took 0.025 sec
[au:antunit] Target: testAntlibTarFileSet took 0.019 sec
[au:antunit] Target: testCreateOfOutOfDate took 4.032 sec
[au:antunit] Target: testFileSetPermissionsWin took 0.02 sec
[au:antunit] Target: testAddDuplicates took 0.009 sec
[au:antunit] Target: testRemoveLeadingSlashes took 0.024 sec
[au:antunit] Target: testPrefixWithSlash took 0.018 sec
[au:antunit] Target: testWithImplicitDirectories took 0.017 sec
[au:antunit] Target: testForceReplaceOfUpToDate took 4.036 sec
[au:antunit] Target: test0PermissionsGetReplaced took 0.022 sec
[au:antunit] Target: testFailDuplicates took 0.005 sec
[au:antunit] Build File: <https://builds.apache.org/job/AntLib-compress/ws/src/tests/antunit/zipentry-test.xml>
[au:antunit] Tests run: 3, Failures: 1, Errors: 0, Time elapsed: 0.026 sec
[au:antunit] Target: testResourceProperties  FAILED
[au:antunit] 	at line 59, column 20
[au:antunit] 	Message: Assertion failed
[au:antunit] 	took 0.013 sec
[au:antunit] Target: testUncompressSource took 0.006 sec
[au:antunit] Target: testZipSource took 0.004 sec
[au:antunit] Build File: <https://builds.apache.org/job/AntLib-compress/ws/src/tests/antunit/zipfileset-test.xml>
[au:antunit] Tests run: 9, Failures: 0, Errors: 0, Time elapsed: 0.08 sec
[au:antunit] Target: testSkipUnreadableEntries took 0.006 sec
[au:antunit] Target: testMissingArchive took 0.003 sec
[au:antunit] Target: testUncompressSource took 0.006 sec
[au:antunit] Target: test-refid-check-encoding took 0.003 sec
[au:antunit] Target: testZipSource took 0.003 sec
[au:antunit] Target: test-refid-modify took 0.031 sec
[au:antunit] Target: test-refid-check-prefix took 0.004 sec
[au:antunit] Target: testMissingArchiveDoesntMatter took 0.003 sec
[au:antunit] Target: testFailsOnUnreadableEntries took 0.004 sec
[au:antunit] Build File: <https://builds.apache.org/job/AntLib-compress/ws/src/tests/antunit/zresource-test.xml>
[au:antunit] Tests run: 1, Failures: 0, Errors: 0, Time elapsed: 0.009 sec
[au:antunit] Target: testNativeZ took 0.006 sec

test:

BUILD FAILED
<https://builds.apache.org/job/AntLib-compress/ws/common/build.xml>:209: At least one
AntUnit test has failed.

Total time: 3 minutes 47 seconds
Build step 'Invoke Ant' marked build as failure
[WARNINGS] Skipping publisher since build result is FAILURE
[TASKS] Skipping publisher since build result is FAILURE
Archiving artifacts
Recording test results
Publishing Javadoc

Mime
View raw message