ant-notifications mailing list archives

Site index · List index
Message view « Date » · « Thread »
Top « Date » · « Thread »
From Apache Jenkins Server <jenk...@builds.apache.org>
Subject Build failed in Jenkins: Ant-Build-Matrix-1.9.x-Linux » JDK 1.5 (latest),Ubuntu #43
Date Sun, 11 Sep 2016 11:48:01 GMT
See <https://builds.apache.org/job/Ant-Build-Matrix-1.9.x-Linux/jdk=JDK%201.5%20(latest),label=Ubuntu/43/changes>

Changes:

[bodewig] remove try-with-resources

[bodewig] really remove Java7 and Java8 features

------------------------------------------
Started by upstream project "Ant-Build-Matrix-1.9.x-Linux" build number 43
originally caused by:
 Started by an SCM change
[EnvInject] - Loading node environment variables.
Building remotely on ubuntu-4 (Ubuntu yahoo-not-h2 ubuntu ubuntu4 docker) in workspace <https://builds.apache.org/job/Ant-Build-Matrix-1.9.x-Linux/jdk=JDK%201.5%20(latest),label=Ubuntu/ws/>
 > git rev-parse --is-inside-work-tree # timeout=10
Fetching changes from the remote Git repository
 > git config remote.origin.url https://git-wip-us.apache.org/repos/asf/ant.git # timeout=10
Cleaning workspace
 > git rev-parse --verify HEAD # timeout=10
Resetting working tree
 > git reset --hard # timeout=10
 > git clean -fdx # timeout=10
Fetching upstream changes from https://git-wip-us.apache.org/repos/asf/ant.git
 > git --version # timeout=10
 > git -c core.askpass=true fetch --tags --progress https://git-wip-us.apache.org/repos/asf/ant.git
+refs/heads/*:refs/remotes/origin/*
Checking out Revision e95fe11095ecd42ef322a0523f6919cec809391b (refs/remotes/origin/1.9.x)
 > git config core.sparsecheckout # timeout=10
 > git checkout -f e95fe11095ecd42ef322a0523f6919cec809391b
 > git rev-list bda488eafe2a5812f77acd6f0134cba5c8a32912 # timeout=10
[EnvInject] - Executing scripts and injecting environment variables after the SCM step.
[EnvInject] - Injecting as environment variables the properties content 
LANG=en_US.utf8

[EnvInject] - Variables injected successfully.
[Ubuntu] $ /home/jenkins/tools/ant/latest/bin/ant -file launch-build.xml "-Djdk=JDK 1.5 (latest)"
-Dlabel=Ubuntu
Buildfile: <https://builds.apache.org/job/Ant-Build-Matrix-1.9.x-Linux/jdk=JDK%201.5%20(latest),label=Ubuntu/ws/launch-build.xml>

launch:
     [echo] Launching <https://builds.apache.org/job/Ant-Build-Matrix-1.9.x-Linux/jdk=JDK%201.5%20(latest),label=Ubuntu/ws/build.sh>
allclean test -Dignore.tests.failed=true -Doptional.jars.whenmanifestonly=skip
     [exec] ... Bootstrapping Ant Distribution
     [exec] ... Compiling Ant Classes
     [exec] Note: Some input files use or override a deprecated API.
     [exec] Note: Recompile with -Xlint:deprecation for details.
     [exec] Note: Some input files use unchecked or unsafe operations.
     [exec] Note: Recompile with -Xlint:unchecked for details.
     [exec] ... Copying Required Files
     [exec] ... Building Ant Distribution
     [exec] Buildfile: <https://builds.apache.org/job/Ant-Build-Matrix-1.9.x-Linux/jdk=JDK%201.5%20(latest),label=Ubuntu/ws/build.xml>
     [exec] 
     [exec] bootstrap:
     [exec] 
     [exec] prepare:
     [exec] 
     [exec] check_for_optional_packages:
     [exec] 
     [exec] build:
     [exec] Created dir: <https://builds.apache.org/job/Ant-Build-Matrix-1.9.x-Linux/jdk=JDK%201.5%20(latest),label=Ubuntu/ws/build/lib>
     [exec] Compiling 269 source files to <https://builds.apache.org/job/Ant-Build-Matrix-1.9.x-Linux/jdk=JDK%201.5%20(latest),label=Ubuntu/ws/build/classes>
     [exec] Note: Some input files use or override a deprecated API.
     [exec] Note: Recompile with -Xlint:deprecation for details.
     [exec] Note: Some input files use unchecked or unsafe operations.
     [exec] Note: Recompile with -Xlint:unchecked for details.
     [exec] Copying 6 files to <https://builds.apache.org/job/Ant-Build-Matrix-1.9.x-Linux/jdk=JDK%201.5%20(latest),label=Ubuntu/ws/build/classes>
     [exec] Copying 2 files to <https://builds.apache.org/job/Ant-Build-Matrix-1.9.x-Linux/jdk=JDK%201.5%20(latest),label=Ubuntu/ws/build/classes>
     [exec] Copying 2 files to <https://builds.apache.org/job/Ant-Build-Matrix-1.9.x-Linux/jdk=JDK%201.5%20(latest),label=Ubuntu/ws/build/classes/org/apache/tools/ant/taskdefs/optional/junit/xsl>
     [exec] 
     [exec] jars:
     [exec] Copying 2 files to <https://builds.apache.org/job/Ant-Build-Matrix-1.9.x-Linux/jdk=JDK%201.5%20(latest),label=Ubuntu/ws/build>
     [exec] Copying 1 file to <https://builds.apache.org/job/Ant-Build-Matrix-1.9.x-Linux/jdk=JDK%201.5%20(latest),label=Ubuntu/ws/build>
     [exec] Building jar: <https://builds.apache.org/job/Ant-Build-Matrix-1.9.x-Linux/jdk=JDK%201.5%20(latest),label=Ubuntu/ws/build/lib/ant-launcher.jar>
     [exec] Building jar: <https://builds.apache.org/job/Ant-Build-Matrix-1.9.x-Linux/jdk=JDK%201.5%20(latest),label=Ubuntu/ws/build/lib/ant.jar>
     [exec] Building jar: <https://builds.apache.org/job/Ant-Build-Matrix-1.9.x-Linux/jdk=JDK%201.5%20(latest),label=Ubuntu/ws/build/lib/ant-bootstrap.jar>
     [exec] Building jar: <https://builds.apache.org/job/Ant-Build-Matrix-1.9.x-Linux/jdk=JDK%201.5%20(latest),label=Ubuntu/ws/build/lib/ant-apache-resolver.jar>
     [exec] Building jar: <https://builds.apache.org/job/Ant-Build-Matrix-1.9.x-Linux/jdk=JDK%201.5%20(latest),label=Ubuntu/ws/build/lib/ant-junit.jar>
     [exec] Building jar: <https://builds.apache.org/job/Ant-Build-Matrix-1.9.x-Linux/jdk=JDK%201.5%20(latest),label=Ubuntu/ws/build/lib/ant-junit4.jar>
     [exec] Building jar: <https://builds.apache.org/job/Ant-Build-Matrix-1.9.x-Linux/jdk=JDK%201.5%20(latest),label=Ubuntu/ws/build/lib/ant-apache-regexp.jar>
     [exec] Building jar: <https://builds.apache.org/job/Ant-Build-Matrix-1.9.x-Linux/jdk=JDK%201.5%20(latest),label=Ubuntu/ws/build/lib/ant-apache-oro.jar>
     [exec] Building jar: <https://builds.apache.org/job/Ant-Build-Matrix-1.9.x-Linux/jdk=JDK%201.5%20(latest),label=Ubuntu/ws/build/lib/ant-apache-bcel.jar>
     [exec] Building jar: <https://builds.apache.org/job/Ant-Build-Matrix-1.9.x-Linux/jdk=JDK%201.5%20(latest),label=Ubuntu/ws/build/lib/ant-apache-log4j.jar>
     [exec] Building jar: <https://builds.apache.org/job/Ant-Build-Matrix-1.9.x-Linux/jdk=JDK%201.5%20(latest),label=Ubuntu/ws/build/lib/ant-commons-logging.jar>
     [exec] Building jar: <https://builds.apache.org/job/Ant-Build-Matrix-1.9.x-Linux/jdk=JDK%201.5%20(latest),label=Ubuntu/ws/build/lib/ant-apache-bsf.jar>
     [exec] Building jar: <https://builds.apache.org/job/Ant-Build-Matrix-1.9.x-Linux/jdk=JDK%201.5%20(latest),label=Ubuntu/ws/build/lib/ant-javamail.jar>
     [exec] Building jar: <https://builds.apache.org/job/Ant-Build-Matrix-1.9.x-Linux/jdk=JDK%201.5%20(latest),label=Ubuntu/ws/build/lib/ant-netrexx.jar>
     [exec] Building jar: <https://builds.apache.org/job/Ant-Build-Matrix-1.9.x-Linux/jdk=JDK%201.5%20(latest),label=Ubuntu/ws/build/lib/ant-commons-net.jar>
     [exec] Building jar: <https://builds.apache.org/job/Ant-Build-Matrix-1.9.x-Linux/jdk=JDK%201.5%20(latest),label=Ubuntu/ws/build/lib/ant-antlr.jar>
     [exec] Building jar: <https://builds.apache.org/job/Ant-Build-Matrix-1.9.x-Linux/jdk=JDK%201.5%20(latest),label=Ubuntu/ws/build/lib/ant-jmf.jar>
     [exec] Building jar: <https://builds.apache.org/job/Ant-Build-Matrix-1.9.x-Linux/jdk=JDK%201.5%20(latest),label=Ubuntu/ws/build/lib/ant-jai.jar>
     [exec] Building jar: <https://builds.apache.org/job/Ant-Build-Matrix-1.9.x-Linux/jdk=JDK%201.5%20(latest),label=Ubuntu/ws/build/lib/ant-swing.jar>
     [exec] Building jar: <https://builds.apache.org/job/Ant-Build-Matrix-1.9.x-Linux/jdk=JDK%201.5%20(latest),label=Ubuntu/ws/build/lib/ant-jsch.jar>
     [exec] Building jar: <https://builds.apache.org/job/Ant-Build-Matrix-1.9.x-Linux/jdk=JDK%201.5%20(latest),label=Ubuntu/ws/build/lib/ant-jdepend.jar>
     [exec] Building jar: <https://builds.apache.org/job/Ant-Build-Matrix-1.9.x-Linux/jdk=JDK%201.5%20(latest),label=Ubuntu/ws/build/lib/ant-apache-xalan2.jar>
     [exec] 
     [exec] compile-tests:
     [exec] Created dir: <https://builds.apache.org/job/Ant-Build-Matrix-1.9.x-Linux/jdk=JDK%201.5%20(latest),label=Ubuntu/ws/build/testcases>
     [exec] Compiling 309 source files to <https://builds.apache.org/job/Ant-Build-Matrix-1.9.x-Linux/jdk=JDK%201.5%20(latest),label=Ubuntu/ws/build/testcases>
     [exec] <https://builds.apache.org/job/Ant-Build-Matrix-1.9.x-Linux/jdk=JDK%201.5%20(latest),label=Ubuntu/ws/src/tests/junit/org/apache/tools/ant/taskdefs/optional/junit/JUnitTaskTest.java>:566:
cannot find symbol
     [exec] symbol  : method copyOf(java.lang.String[],int)
     [exec] location: class java.util.Arrays
     [exec]             this.cmd = Arrays.copyOf(cmd, cmd.length);
     [exec]                              ^
     [exec] Note: Some input files use or override a deprecated API.
     [exec] Note: Recompile with -Xlint:deprecation for details.
     [exec] Note: Some input files use unchecked or unsafe operations.
     [exec] Note: Recompile with -Xlint:unchecked for details.
     [exec] 1 error
     [exec] ... Failed Building Ant Distribution !
     [exec] Bootstrap FAILED
     [exec] 
     [exec] BUILD FAILED
     [exec] <https://builds.apache.org/job/Ant-Build-Matrix-1.9.x-Linux/jdk=JDK%201.5%20(latest),label=Ubuntu/ws/build.xml>:1076:
The following error occurred while executing this line:
     [exec] <https://builds.apache.org/job/Ant-Build-Matrix-1.9.x-Linux/jdk=JDK%201.5%20(latest),label=Ubuntu/ws/build.xml>:1503:
Compile failed; see the compiler error output for details.
     [exec] 
     [exec] Total time: 12 seconds

BUILD FAILED
<https://builds.apache.org/job/Ant-Build-Matrix-1.9.x-Linux/jdk=JDK%201.5%20(latest),label=Ubuntu/ws/launch-build.xml>:36:
exec returned: 1

Total time: 22 seconds
Build step 'Invoke Ant' marked build as failure
Recording test results
ERROR: Step ?Publish JUnit test result report? failed: No test report files were found. Configuration
error?


Mime
View raw message