ant-notifications mailing list archives

Site index · List index
Message view « Date » · « Thread »
Top « Date » · « Thread »
From Apache Jenkins Server <jenk...@builds.apache.org>
Subject Build failed in Jenkins: Ant-Build-Matrix-1.9.x-Linux » JDK 1.5 (latest),Ubuntu #42
Date Sun, 11 Sep 2016 10:47:47 GMT
See <https://builds.apache.org/job/Ant-Build-Matrix-1.9.x-Linux/jdk=JDK%201.5%20(latest),label=Ubuntu/42/changes>

Changes:

[bodewig] JDK9 modules support for JUnit by Tomáš Zezula

[bodewig] linefeeds

[bodewig] fix version numbers

[bodewig] record JDK9 module support for junit

[bodewig] JDK9 command line options updated to JEP 293

[bodewig] Fixed forgotten -upgrademodulepath in the DefaultCompilerAdapter.

------------------------------------------
Started by upstream project "Ant-Build-Matrix-1.9.x-Linux" build number 42
originally caused by:
 Started by an SCM change
[EnvInject] - Loading node environment variables.
Building remotely on ubuntu-4 (Ubuntu yahoo-not-h2 ubuntu ubuntu4 docker) in workspace <https://builds.apache.org/job/Ant-Build-Matrix-1.9.x-Linux/jdk=JDK%201.5%20(latest),label=Ubuntu/ws/>
 > git rev-parse --is-inside-work-tree # timeout=10
Fetching changes from the remote Git repository
 > git config remote.origin.url https://git-wip-us.apache.org/repos/asf/ant.git # timeout=10
Cleaning workspace
 > git rev-parse --verify HEAD # timeout=10
Resetting working tree
 > git reset --hard # timeout=10
 > git clean -fdx # timeout=10
Fetching upstream changes from https://git-wip-us.apache.org/repos/asf/ant.git
 > git --version # timeout=10
 > git -c core.askpass=true fetch --tags --progress https://git-wip-us.apache.org/repos/asf/ant.git
+refs/heads/*:refs/remotes/origin/*
Checking out Revision bda488eafe2a5812f77acd6f0134cba5c8a32912 (refs/remotes/origin/1.9.x)
 > git config core.sparsecheckout # timeout=10
 > git checkout -f bda488eafe2a5812f77acd6f0134cba5c8a32912
 > git rev-list 1d7b624155b06f665c8b99014227bc1f87f9ec54 # timeout=10
[EnvInject] - Executing scripts and injecting environment variables after the SCM step.
[EnvInject] - Injecting as environment variables the properties content 
LANG=en_US.utf8

[EnvInject] - Variables injected successfully.
[Ubuntu] $ /home/jenkins/tools/ant/latest/bin/ant -file launch-build.xml "-Djdk=JDK 1.5 (latest)"
-Dlabel=Ubuntu
Buildfile: <https://builds.apache.org/job/Ant-Build-Matrix-1.9.x-Linux/jdk=JDK%201.5%20(latest),label=Ubuntu/ws/launch-build.xml>

launch:
     [echo] Launching <https://builds.apache.org/job/Ant-Build-Matrix-1.9.x-Linux/jdk=JDK%201.5%20(latest),label=Ubuntu/ws/build.sh>
allclean test -Dignore.tests.failed=true -Doptional.jars.whenmanifestonly=skip
     [exec] ... Bootstrapping Ant Distribution
     [exec] ... Compiling Ant Classes
     [exec] Note: Some input files use or override a deprecated API.
     [exec] Note: Recompile with -Xlint:deprecation for details.
     [exec] Note: Some input files use unchecked or unsafe operations.
     [exec] Note: Recompile with -Xlint:unchecked for details.
     [exec] ... Copying Required Files
     [exec] ... Building Ant Distribution
     [exec] Buildfile: <https://builds.apache.org/job/Ant-Build-Matrix-1.9.x-Linux/jdk=JDK%201.5%20(latest),label=Ubuntu/ws/build.xml>
     [exec] 
     [exec] bootstrap:
     [exec] 
     [exec] prepare:
     [exec] 
     [exec] check_for_optional_packages:
     [exec] 
     [exec] build:
     [exec] Created dir: <https://builds.apache.org/job/Ant-Build-Matrix-1.9.x-Linux/jdk=JDK%201.5%20(latest),label=Ubuntu/ws/build/lib>
     [exec] Compiling 269 source files to <https://builds.apache.org/job/Ant-Build-Matrix-1.9.x-Linux/jdk=JDK%201.5%20(latest),label=Ubuntu/ws/build/classes>
     [exec] <https://builds.apache.org/job/Ant-Build-Matrix-1.9.x-Linux/jdk=JDK%201.5%20(latest),label=Ubuntu/ws/src/main/org/apache/tools/ant/taskdefs/optional/junit/JUnitTask.java>:1752:
'{' expected
     [exec]         try (AntClassLoader loader = AntClassLoader.newAntClassLoader(
     [exec]             ^
     [exec] <https://builds.apache.org/job/Ant-Build-Matrix-1.9.x-Linux/jdk=JDK%201.5%20(latest),label=Ubuntu/ws/src/main/org/apache/tools/ant/taskdefs/optional/junit/JUnitTask.java>:1752:
'try' without 'catch' or 'finally'
     [exec]         try (AntClassLoader loader = AntClassLoader.newAntClassLoader(
     [exec]         ^
     [exec] <https://builds.apache.org/job/Ant-Build-Matrix-1.9.x-Linux/jdk=JDK%201.5%20(latest),label=Ubuntu/ws/src/main/org/apache/tools/ant/taskdefs/optional/junit/JUnitTask.java>:1772:
illegal start of expression
     [exec]     private Path expandModulePath(Path modulePath) {
     [exec]     ^
     [exec] <https://builds.apache.org/job/Ant-Build-Matrix-1.9.x-Linux/jdk=JDK%201.5%20(latest),label=Ubuntu/ws/src/main/org/apache/tools/ant/taskdefs/optional/junit/JUnitTask.java>:1877:
';' expected
     [exec]         final File f = LoaderUtils.getResourceSource(JUnitTask.class.getClassLoader(),
     [exec]                                                                ^
     [exec] <https://builds.apache.org/job/Ant-Build-Matrix-1.9.x-Linux/jdk=JDK%201.5%20(latest),label=Ubuntu/ws/src/main/org/apache/tools/ant/taskdefs/optional/junit/JUnitTask.java>:1877:
<identifier> expected
     [exec]         final File f = LoaderUtils.getResourceSource(JUnitTask.class.getClassLoader(),
     [exec]                                                                     ^
     [exec] <https://builds.apache.org/job/Ant-Build-Matrix-1.9.x-Linux/jdk=JDK%201.5%20(latest),label=Ubuntu/ws/src/main/org/apache/tools/ant/taskdefs/optional/junit/JUnitTask.java>:1878:
'{' expected
     [exec]                                                resource);
     [exec]                                                         ^
     [exec] <https://builds.apache.org/job/Ant-Build-Matrix-1.9.x-Linux/jdk=JDK%201.5%20(latest),label=Ubuntu/ws/src/main/org/apache/tools/ant/taskdefs/optional/junit/JUnitTask.java>:1879:
illegal start of type
     [exec]         if (f != null) {
     [exec]         ^
     [exec] <https://builds.apache.org/job/Ant-Build-Matrix-1.9.x-Linux/jdk=JDK%201.5%20(latest),label=Ubuntu/ws/src/main/org/apache/tools/ant/taskdefs/optional/junit/JUnitTask.java>:1887:
<identifier> expected
     [exec]     }
     [exec]     ^
     [exec] <https://builds.apache.org/job/Ant-Build-Matrix-1.9.x-Linux/jdk=JDK%201.5%20(latest),label=Ubuntu/ws/src/main/org/apache/tools/ant/taskdefs/optional/junit/JUnitTask.java>:1889:
illegal start of expression
     [exec]     static final String TIMEOUT_MESSAGE =
     [exec]     ^
     [exec] <https://builds.apache.org/job/Ant-Build-Matrix-1.9.x-Linux/jdk=JDK%201.5%20(latest),label=Ubuntu/ws/src/main/org/apache/tools/ant/taskdefs/optional/junit/JUnitTask.java>:1899:
illegal start of expression
     [exec]     private void logTimeout(final FormatterElement[] feArray, final JUnitTest
test,
     [exec]     ^
     [exec] <https://builds.apache.org/job/Ant-Build-Matrix-1.9.x-Linux/jdk=JDK%201.5%20(latest),label=Ubuntu/ws/src/main/org/apache/tools/ant/taskdefs/optional/junit/JUnitTask.java>:2007:
';' expected
     [exec]                     && getClass().getClassLoader() != Project.class.getClassLoader())
{
     [exec]                                                               ^
     [exec] <https://builds.apache.org/job/Ant-Build-Matrix-1.9.x-Linux/jdk=JDK%201.5%20(latest),label=Ubuntu/ws/src/main/org/apache/tools/ant/taskdefs/optional/junit/JUnitTask.java>:2007:
<identifier> expected
     [exec]                     && getClass().getClassLoader() != Project.class.getClassLoader())
{
     [exec]                                                                    ^
     [exec] <https://builds.apache.org/job/Ant-Build-Matrix-1.9.x-Linux/jdk=JDK%201.5%20(latest),label=Ubuntu/ws/src/main/org/apache/tools/ant/taskdefs/optional/junit/JUnitTask.java>:2010:
'{' expected
     [exec]                 classLoader.setParentFirst(false);
     [exec]                                                  ^
     [exec] <https://builds.apache.org/job/Ant-Build-Matrix-1.9.x-Linux/jdk=JDK%201.5%20(latest),label=Ubuntu/ws/src/main/org/apache/tools/ant/taskdefs/optional/junit/JUnitTask.java>:2011:
<identifier> expected
     [exec]                 classLoader.addJavaLibraries();
     [exec]                                             ^
     [exec] <https://builds.apache.org/job/Ant-Build-Matrix-1.9.x-Linux/jdk=JDK%201.5%20(latest),label=Ubuntu/ws/src/main/org/apache/tools/ant/taskdefs/optional/junit/JUnitTask.java>:2012:
invalid method declaration; return type required
     [exec]                 log("Using CLASSPATH " + classLoader.getClasspath(),
     [exec]                 ^
     [exec] <https://builds.apache.org/job/Ant-Build-Matrix-1.9.x-Linux/jdk=JDK%201.5%20(latest),label=Ubuntu/ws/src/main/org/apache/tools/ant/taskdefs/optional/junit/JUnitTask.java>:2012:
illegal start of type
     [exec]                 log("Using CLASSPATH " + classLoader.getClasspath(),
     [exec]                     ^
     [exec] <https://builds.apache.org/job/Ant-Build-Matrix-1.9.x-Linux/jdk=JDK%201.5%20(latest),label=Ubuntu/ws/src/main/org/apache/tools/ant/taskdefs/optional/junit/JUnitTask.java>:2013:
<identifier> expected
     [exec]                     Project.MSG_VERBOSE);
     [exec]                                         ^
     [exec] <https://builds.apache.org/job/Ant-Build-Matrix-1.9.x-Linux/jdk=JDK%201.5%20(latest),label=Ubuntu/ws/src/main/org/apache/tools/ant/taskdefs/optional/junit/JUnitTask.java>:2015:
<identifier> expected
     [exec]                 classLoader.addSystemPackageRoot("junit");
     [exec]                                                 ^
     [exec] <https://builds.apache.org/job/Ant-Build-Matrix-1.9.x-Linux/jdk=JDK%201.5%20(latest),label=Ubuntu/ws/src/main/org/apache/tools/ant/taskdefs/optional/junit/JUnitTask.java>:2017:
<identifier> expected
     [exec]                 classLoader.addSystemPackageRoot("org.junit");
     [exec]                                                 ^
     [exec] <https://builds.apache.org/job/Ant-Build-Matrix-1.9.x-Linux/jdk=JDK%201.5%20(latest),label=Ubuntu/ws/src/main/org/apache/tools/ant/taskdefs/optional/junit/JUnitTask.java>:2019:
<identifier> expected
     [exec]                 classLoader.addSystemPackageRoot("org.apache.tools.ant");
     [exec]                                                 ^
     [exec] <https://builds.apache.org/job/Ant-Build-Matrix-1.9.x-Linux/jdk=JDK%201.5%20(latest),label=Ubuntu/ws/src/main/org/apache/tools/ant/taskdefs/optional/junit/JUnitTask.java>:2033:
'class' or 'interface' expected
     [exec]     protected void cleanup() {
     [exec]               ^
     [exec] <https://builds.apache.org/job/Ant-Build-Matrix-1.9.x-Linux/jdk=JDK%201.5%20(latest),label=Ubuntu/ws/src/main/org/apache/tools/ant/taskdefs/optional/junit/JUnitTask.java>:2197:
'class' or 'interface' expected
     [exec]     protected Collection<List> executeOrQueue(final Enumeration<JUnitTest>
testList,
     [exec]               ^
     [exec] <https://builds.apache.org/job/Ant-Build-Matrix-1.9.x-Linux/jdk=JDK%201.5%20(latest),label=Ubuntu/ws/src/main/org/apache/tools/ant/taskdefs/optional/junit/JUnitTask.java>:2346:
'class' or 'interface' expected
     [exec]     static final String NAME_OF_DUMMY_TEST = "Batch-With-Multiple-Tests";
     [exec]                  ^
     [exec] <https://builds.apache.org/job/Ant-Build-Matrix-1.9.x-Linux/jdk=JDK%201.5%20(latest),label=Ubuntu/ws/src/main/org/apache/tools/ant/taskdefs/optional/junit/JUnitTask.java>:2362:
'class' or 'interface' expected
     [exec]     private static JUnitTest createDummyTestForBatchTest(final JUnitTest test)
{
     [exec]                    ^
     [exec] <https://builds.apache.org/job/Ant-Build-Matrix-1.9.x-Linux/jdk=JDK%201.5%20(latest),label=Ubuntu/ws/src/main/org/apache/tools/ant/taskdefs/optional/junit/JUnitTask.java>:2404:
'class' or 'interface' expected
     [exec] }
     [exec] ^
     [exec] <https://builds.apache.org/job/Ant-Build-Matrix-1.9.x-Linux/jdk=JDK%201.5%20(latest),label=Ubuntu/ws/src/main/org/apache/tools/ant/taskdefs/optional/junit/JUnitTask.java>:2405:
'class' or 'interface' expected
     [exec] ^
     [exec] 
     [exec] BUILD FAILED
     [exec] <https://builds.apache.org/job/Ant-Build-Matrix-1.9.x-Linux/jdk=JDK%201.5%20(latest),label=Ubuntu/ws/build.xml>:1076:
The following error occurred while executing this line:
     [exec] <https://builds.apache.org/job/Ant-Build-Matrix-1.9.x-Linux/jdk=JDK%201.5%20(latest),label=Ubuntu/ws/build.xml>:575:
Compile failed; see the compiler error output for details.
     [exec] 
     [exec] Total time: 2 seconds
     [exec] 26 errors
     [exec] ... Failed Building Ant Distribution !
     [exec] Bootstrap FAILED

BUILD FAILED
<https://builds.apache.org/job/Ant-Build-Matrix-1.9.x-Linux/jdk=JDK%201.5%20(latest),label=Ubuntu/ws/launch-build.xml>:36:
exec returned: 1

Total time: 12 seconds
Build step 'Invoke Ant' marked build as failure
Recording test results
ERROR: Step ?Publish JUnit test result report? failed: No test report files were found. Configuration
error?


Mime
View raw message