ant-notifications mailing list archives

Site index · List index
Message view « Date » · « Thread »
Top « Date » · « Thread »
From Apache Jenkins Server <jenk...@builds.apache.org>
Subject Build failed in Jenkins: AntLib-antunit #28
Date Mon, 11 Jul 2016 16:43:00 GMT
See <https://builds.apache.org/job/AntLib-antunit/28/changes>

Changes:

[bodewig] debug logging

------------------------------------------
[...truncated 156 lines...]
[ivy:retrieve] 	0 artifacts copied, 2 already retrieved (0kB/3ms)
[ivy:retrieve] :: retrieving :: Apache Ant#ant-antunit [sync]
[ivy:retrieve] 	confs: [test]
[ivy:retrieve] 	0 artifacts copied, 0 already retrieved (0kB/1ms)

compile:

check-for-NOTICE:

antlib:

checksum-target-jar:

m2-init:

m2-copy-pom:
[expandingcopy] Copying 1 file to <https://builds.apache.org/job/AntLib-antunit/ws/build/lib>

m2-make-pom:

m2-pom:

ivy-init:

copy-ivy.xml:

make-ivy.xml:

ivy.xml:

javadoc_check:

javadoc:
    [mkdir] Created dir: <https://builds.apache.org/job/AntLib-antunit/ws/build/javadoc>
  [javadoc] Generating Javadoc
  [javadoc] Javadoc execution
  [javadoc] Loading source files for package org.apache.ant.antunit...
  [javadoc] Loading source files for package org.apache.ant.antunit.junit3...
  [javadoc] Loading source files for package org.apache.ant.antunit.junit4...
  [javadoc] Loading source files for package org.apache.ant.antunit.listener...
  [javadoc] Constructing Javadoc information...
  [javadoc] Standard Doclet version 1.5.0_22
  [javadoc] Building tree for all the packages and classes...
  [javadoc] Building index for all the packages and classes...
  [javadoc] Building index for all classes...

bin-dist:
    [mkdir] Created dir: <https://builds.apache.org/job/AntLib-antunit/ws/apache-ant-antunit-1.4alpha>
     [copy] Copying 21 files to <https://builds.apache.org/job/AntLib-antunit/ws/apache-ant-antunit-1.4alpha>
     [copy] Copying 54 files to <https://builds.apache.org/job/AntLib-antunit/ws/apache-ant-antunit-1.4alpha/javadoc>
     [copy] Copying 2 files to <https://builds.apache.org/job/AntLib-antunit/ws/apache-ant-antunit-1.4alpha>

check-contributors:

style-contributors:
     [xslt] Processing <https://builds.apache.org/job/AntLib-antunit/ws/contributors.xml>
to <https://builds.apache.org/job/AntLib-antunit/ws/apache-ant-antunit-1.4alpha/CONTRIBUTORS>
     [xslt] Loading stylesheet <https://builds.apache.org/job/AntLib-antunit/ws/common/stylesheets/contributors.xsl>

check-changes:

style-changes:
     [xslt] Processing <https://builds.apache.org/job/AntLib-antunit/ws/changes.xml>
to <https://builds.apache.org/job/AntLib-antunit/ws/apache-ant-antunit-1.4alpha/WHATSNEW>
     [xslt] Loading stylesheet <https://builds.apache.org/job/AntLib-antunit/ws/common/stylesheets/changes2whatsnew.xsl>
     [xslt] Processing <https://builds.apache.org/job/AntLib-antunit/ws/changes.xml>
to <https://builds.apache.org/job/AntLib-antunit/ws/apache-ant-antunit-1.4alpha/README.html>
     [xslt] Loading stylesheet <https://builds.apache.org/job/AntLib-antunit/ws/common/stylesheets/changes2readmehtml.xsl>

create-readable-documents:
      [zip] Building zip: <https://builds.apache.org/job/AntLib-antunit/28/artifact/distribution/binaries/apache-ant-antunit-1.4alpha-bin.zip>
      [tar] Building tar: <https://builds.apache.org/job/AntLib-antunit/28/artifact/distribution/binaries/apache-ant-antunit-1.4alpha-bin.tar>
     [gzip] Building: <https://builds.apache.org/job/AntLib-antunit/28/artifact/distribution/binaries/apache-ant-antunit-1.4alpha-bin.tar.gz>
    [bzip2] Building: <https://builds.apache.org/job/AntLib-antunit/28/artifact/distribution/binaries/apache-ant-antunit-1.4alpha-bin.tar.bz2>
   [delete] Deleting: <https://builds.apache.org/job/AntLib-antunit/28/artifact/distribution/binaries/apache-ant-antunit-1.4alpha-bin.tar>
   [delete] Deleting directory <https://builds.apache.org/job/AntLib-antunit/ws/apache-ant-antunit-1.4alpha>

setup-properties:

setup:

m2-init:

m2-copy-pom:

m2-make-pom:

m2-pom:

ivy-init:

copy-ivy.xml:

make-ivy.xml:

ivy.xml:

src-dist:
    [mkdir] Created dir: <https://builds.apache.org/job/AntLib-antunit/ws/apache-ant-antunit-1.4alpha>
     [copy] Copying 120 files to <https://builds.apache.org/job/AntLib-antunit/ws/apache-ant-antunit-1.4alpha>

check-contributors:

style-contributors:
     [xslt] Processing <https://builds.apache.org/job/AntLib-antunit/ws/contributors.xml>
to <https://builds.apache.org/job/AntLib-antunit/ws/apache-ant-antunit-1.4alpha/CONTRIBUTORS>
     [xslt] Loading stylesheet <https://builds.apache.org/job/AntLib-antunit/ws/common/stylesheets/contributors.xsl>

check-changes:

style-changes:
     [xslt] Processing <https://builds.apache.org/job/AntLib-antunit/ws/changes.xml>
to <https://builds.apache.org/job/AntLib-antunit/ws/apache-ant-antunit-1.4alpha/WHATSNEW>
     [xslt] Loading stylesheet <https://builds.apache.org/job/AntLib-antunit/ws/common/stylesheets/changes2whatsnew.xsl>
     [xslt] Processing <https://builds.apache.org/job/AntLib-antunit/ws/changes.xml>
to <https://builds.apache.org/job/AntLib-antunit/ws/apache-ant-antunit-1.4alpha/README.html>
     [xslt] Loading stylesheet <https://builds.apache.org/job/AntLib-antunit/ws/common/stylesheets/changes2readmehtml.xsl>

create-readable-documents:
      [zip] Building zip: <https://builds.apache.org/job/AntLib-antunit/28/artifact/distribution/source/apache-ant-antunit-1.4alpha-src.zip>
      [tar] Building tar: <https://builds.apache.org/job/AntLib-antunit/28/artifact/distribution/source/apache-ant-antunit-1.4alpha-src.tar>
     [gzip] Building: <https://builds.apache.org/job/AntLib-antunit/28/artifact/distribution/source/apache-ant-antunit-1.4alpha-src.tar.gz>
    [bzip2] Building: <https://builds.apache.org/job/AntLib-antunit/28/artifact/distribution/source/apache-ant-antunit-1.4alpha-src.tar.bz2>
   [delete] Deleting: <https://builds.apache.org/job/AntLib-antunit/28/artifact/distribution/source/apache-ant-antunit-1.4alpha-src.tar>
   [delete] Deleting directory <https://builds.apache.org/job/AntLib-antunit/ws/apache-ant-antunit-1.4alpha>

BUILD SUCCESSFUL
Total time: 8 seconds
Unpacking http://archive.apache.org/dist/ant/binaries/apache-ant-1.9.3-bin.zip to /home/jenkins/jenkins-slave/tools/hudson.tasks.Ant_AntInstallation/ant-1.9.3
on jenkins-test-188
[antunit] $ /home/jenkins/jenkins-slave/tools/hudson.tasks.Ant_AntInstallation/ant-1.9.3/bin/ant
-file assertResourceExists-test.xml -lib ../../../build/lib -lib ../../../lib/compile -lib
../../../lib/test -lib ../../../build/test-classes testURLUsingRef-no -v
Apache Ant(TM) version 1.9.3 compiled on December 23 2013
Buildfile: <https://builds.apache.org/job/AntLib-antunit/ws/src/tests/antunit/assertResourceExists-test.xml>
Detected Java version: 1.5 in: /home/jenkins/tools/java/jdk1.5.0_22-32/jre
Detected OS: Linux
parsing buildfile <https://builds.apache.org/job/AntLib-antunit/ws/src/tests/antunit/assertResourceExists-test.xml>
with URI = <https://builds.apache.org/job/AntLib-antunit/ws/src/tests/antunit/assertResourceExists-test.xml>
Project base dir set to: <https://builds.apache.org/job/AntLib-antunit/ws/src/tests/antunit>
parsing buildfile jar:file:/home/jenkins/jenkins-slave/tools/hudson.tasks.Ant_AntInstallation/ant-1.9.3/lib/ant.jar!/org/apache/tools/ant/antlib.xml
with URI = jar:file:/home/jenkins/jenkins-slave/tools/hudson.tasks.Ant_AntInstallation/ant-1.9.3/lib/ant.jar!/org/apache/tools/ant/antlib.xml
from a zip file
Importing file <https://builds.apache.org/job/AntLib-antunit/ws/src/tests/antunit/antunit-base.xml>
from <https://builds.apache.org/job/AntLib-antunit/ws/src/tests/antunit/assertResourceExists-test.xml>
Overriding previous definition of reference to ant.projectHelper
parsing buildfile <https://builds.apache.org/job/AntLib-antunit/ws/src/tests/antunit/antunit-base.xml>
with URI = <https://builds.apache.org/job/AntLib-antunit/ws/src/tests/antunit/antunit-base.xml>
Property "build.sysclasspath" has not been set
Overriding previous definition of reference to ant.projectHelper
Build sequence for target(s) `testURLUsingRef-no' is [-checkWhetherUrlsThatDontExistAreFound,
-logWhetherUrlsThatDontExistAreFound, testURLUsingRef-no]
Complete build sequence is [-checkWhetherUrlsThatDontExistAreFound, -logWhetherUrlsThatDontExistAreFound,
testURLUsingRef-no, antunit, tearDown, testURL, testURL-no, testURLUsingRef, antunit-base.antunit,
antunit-base.tearDown, ]

-checkWhetherUrlsThatDontExistAreFound:
Checking for http://ant.apache.org/foo.html
Result code for http://ant.apache.org/foo.html was 404

-logWhetherUrlsThatDontExistAreFound:
Skipped because property 'cant.trust.urlcheck' not set.

testURLUsingRef-no:
parsing buildfile jar:<https://builds.apache.org/job/AntLib-antunit/ws/src/tests/antunit/../../../build/lib/ant-antunit-1.4alpha.jar!/org/apache/ant/antunit/antlib.xml>
with URI = jar:<https://builds.apache.org/job/AntLib-antunit/ws/src/tests/antunit/../../../build/lib/ant-antunit-1.4alpha.jar!/org/apache/ant/antunit/antlib.xml>
from a zip file
 [macrodef] creating macro  antlib:org.apache.ant.antunit:assertTrue
 [macrodef] creating macro  antlib:org.apache.ant.antunit:assertFalse
 [macrodef] creating macro  antlib:org.apache.ant.antunit:assertEquals
 [macrodef] creating macro  antlib:org.apache.ant.antunit:assertPropertySet
Property "@{name" has not been set
 [macrodef] creating macro  antlib:org.apache.ant.antunit:assertPropertyEquals
Property "@{name" has not been set
 [macrodef] creating macro  antlib:org.apache.ant.antunit:assertPropertyContains
 [macrodef] creating macro  antlib:org.apache.ant.antunit:assertFileExists
 [macrodef] creating macro  antlib:org.apache.ant.antunit:assertFileDoesntExist
 [macrodef] creating macro  antlib:org.apache.ant.antunit:assertResourceExists
 [macrodef] creating macro  antlib:org.apache.ant.antunit:assertResourceDoesntExist
Property "@{resource" has not been set
 [macrodef] creating macro  antlib:org.apache.ant.antunit:assertResourceContains
Property "@{resource" has not been set
 [macrodef] creating macro  antlib:org.apache.ant.antunit:assertResourceDoesntContain
 [macrodef] creating macro  antlib:org.apache.ant.antunit:assertNestedResourceExists
 [macrodef] creating macro  antlib:org.apache.ant.antunit:assertNestedResourceDoesntExist
 [macrodef] creating macro  antlib:org.apache.ant.antunit:assertRefResourceExists
 [macrodef] creating macro  antlib:org.apache.ant.antunit:assertRefResourceDoesntExist
 [macrodef] creating macro  antlib:org.apache.ant.antunit:assertRefResourceContains
 [macrodef] creating macro  antlib:org.apache.ant.antunit:assertRefResourceDoesntContain
 [macrodef] creating macro  antlib:org.apache.ant.antunit:assertDestIsUptodate
 [macrodef] creating macro  antlib:org.apache.ant.antunit:assertDestIsOutofdate
 [macrodef] creating macro  antlib:org.apache.ant.antunit:assertFilesMatch
 [macrodef] creating macro  antlib:org.apache.ant.antunit:assertFilesDiffer
 [macrodef] creating macro  antlib:org.apache.ant.antunit:assertReferenceSet
 [macrodef] creating macro  antlib:org.apache.ant.antunit:assertReferenceIsType
 [macrodef] creating macro  antlib:org.apache.ant.antunit:assertLogContains
 [macrodef] creating macro  antlib:org.apache.ant.antunit:assertLogDoesntContain
 [macrodef] creating macro  antlib:org.apache.ant.antunit:assertMatches
 [macrodef] creating macro  antlib:org.apache.ant.antunit:assertDoesntMatch
Checking: http://ant.apache.org/foo.html

BUILD FAILED
<https://builds.apache.org/job/AntLib-antunit/ws/src/tests/antunit/assertResourceExists-test.xml>:65:
Didn't expect resource 'antsite-foo' to exist
	at org.apache.ant.antunit.AssertTask.execute(AssertTask.java:73)
	at sun.reflect.NativeMethodAccessorImpl.invoke0(Native Method)
	at sun.reflect.NativeMethodAccessorImpl.invoke(NativeMethodAccessorImpl.java:39)
	at sun.reflect.DelegatingMethodAccessorImpl.invoke(DelegatingMethodAccessorImpl.java:25)
	at java.lang.reflect.Method.invoke(Method.java:592)
	at org.apache.tools.ant.dispatch.DispatchUtils.execute(DispatchUtils.java:106)
	at org.apache.tools.ant.TaskAdapter.execute(TaskAdapter.java:154)
	at org.apache.tools.ant.UnknownElement.execute(UnknownElement.java:292)
	at sun.reflect.NativeMethodAccessorImpl.invoke0(Native Method)
	at sun.reflect.NativeMethodAccessorImpl.invoke(NativeMethodAccessorImpl.java:39)
	at sun.reflect.DelegatingMethodAccessorImpl.invoke(DelegatingMethodAccessorImpl.java:25)
	at java.lang.reflect.Method.invoke(Method.java:592)
	at org.apache.tools.ant.dispatch.DispatchUtils.execute(DispatchUtils.java:106)
	at org.apache.tools.ant.Task.perform(Task.java:348)
	at org.apache.tools.ant.taskdefs.Sequential.execute(Sequential.java:68)
	at org.apache.tools.ant.UnknownElement.execute(UnknownElement.java:292)
	at sun.reflect.NativeMethodAccessorImpl.invoke0(Native Method)
	at sun.reflect.NativeMethodAccessorImpl.invoke(NativeMethodAccessorImpl.java:39)
	at sun.reflect.DelegatingMethodAccessorImpl.invoke(DelegatingMethodAccessorImpl.java:25)
	at java.lang.reflect.Method.invoke(Method.java:592)
	at org.apache.tools.ant.dispatch.DispatchUtils.execute(DispatchUtils.java:106)
	at org.apache.tools.ant.Task.perform(Task.java:348)
	at org.apache.tools.ant.taskdefs.MacroInstance.execute(MacroInstance.java:396)
	at org.apache.tools.ant.UnknownElement.execute(UnknownElement.java:292)
	at sun.reflect.NativeMethodAccessorImpl.invoke0(Native Method)
	at sun.reflect.NativeMethodAccessorImpl.invoke(NativeMethodAccessorImpl.java:39)
	at sun.reflect.DelegatingMethodAccessorImpl.invoke(DelegatingMethodAccessorImpl.java:25)
	at java.lang.reflect.Method.invoke(Method.java:592)
	at org.apache.tools.ant.dispatch.DispatchUtils.execute(DispatchUtils.java:106)
	at org.apache.tools.ant.Task.perform(Task.java:348)
	at org.apache.tools.ant.taskdefs.Sequential.execute(Sequential.java:68)
	at org.apache.tools.ant.UnknownElement.execute(UnknownElement.java:292)
	at sun.reflect.NativeMethodAccessorImpl.invoke0(Native Method)
	at sun.reflect.NativeMethodAccessorImpl.invoke(NativeMethodAccessorImpl.java:39)
	at sun.reflect.DelegatingMethodAccessorImpl.invoke(DelegatingMethodAccessorImpl.java:25)
	at java.lang.reflect.Method.invoke(Method.java:592)
	at org.apache.tools.ant.dispatch.DispatchUtils.execute(DispatchUtils.java:106)
	at org.apache.tools.ant.Task.perform(Task.java:348)
	at org.apache.tools.ant.taskdefs.MacroInstance.execute(MacroInstance.java:396)
	at org.apache.tools.ant.UnknownElement.execute(UnknownElement.java:292)
	at sun.reflect.NativeMethodAccessorImpl.invoke0(Native Method)
	at sun.reflect.NativeMethodAccessorImpl.invoke(NativeMethodAccessorImpl.java:39)
	at sun.reflect.DelegatingMethodAccessorImpl.invoke(DelegatingMethodAccessorImpl.java:25)
	at java.lang.reflect.Method.invoke(Method.java:592)
	at org.apache.tools.ant.dispatch.DispatchUtils.execute(DispatchUtils.java:106)
	at org.apache.tools.ant.Task.perform(Task.java:348)
	at org.apache.tools.ant.Target.execute(Target.java:435)
	at org.apache.tools.ant.Target.performTasks(Target.java:456)
	at org.apache.tools.ant.Project.executeSortedTargets(Project.java:1393)
	at org.apache.tools.ant.Project.executeTarget(Project.java:1364)
	at org.apache.tools.ant.helper.DefaultExecutor.executeTargets(DefaultExecutor.java:41)
	at org.apache.tools.ant.Project.executeTargets(Project.java:1248)
	at org.apache.tools.ant.Main.runBuild(Main.java:851)
	at org.apache.tools.ant.Main.startAnt(Main.java:235)
	at org.apache.tools.ant.launch.Launcher.run(Launcher.java:280)
	at org.apache.tools.ant.launch.Launcher.main(Launcher.java:109)

Total time: 0 seconds
Build step 'Invoke Ant' marked build as failure
[WARNINGS] Skipping publisher since build result is FAILURE
[TASKS] Skipping publisher since build result is FAILURE
Archiving artifacts
Recording test results
ERROR: Step ‘Publish JUnit test result report’ failed: No test report files were found.
Configuration error?
Publishing Javadoc

Mime
View raw message