ant-notifications mailing list archives

Site index · List index
Message view « Date » · « Thread »
Top « Date » · « Thread »
From Apache Jenkins Server <jenk...@builds.apache.org>
Subject Build failed in Jenkins: Ant-Build-Matrix » Open JDK 1.8 (Only on ubuntu nodes),Ubuntu #733
Date Thu, 21 Aug 2014 12:30:09 GMT
See <https://builds.apache.org/job/Ant-Build-Matrix/jdk=Open%20JDK%201.8%20(Only%20on%20ubuntu%20nodes),label=Ubuntu/733/changes>

Changes:

[bodewig] PR 56873 make sure connection is established when reading last modified

------------------------------------------
[...truncated 972 lines...]
     [exec]     [junit] Testsuite: org.apache.tools.ant.types.MapperTest
     [exec]     [junit] Tests run: 5, Failures: 0, Errors: 0, Skipped: 0, Time elapsed: 0.824
sec
     [exec]     [junit] 
     [exec]     [junit] Testsuite: org.apache.tools.ant.types.PathTest
     [exec]     [junit] Tests run: 15, Failures: 0, Errors: 0, Skipped: 0, Time elapsed: 0.011
sec
     [exec]     [junit] 
     [exec]     [junit] Testsuite: org.apache.tools.ant.types.PatternSetTest
     [exec]     [junit] Tests run: 3, Failures: 0, Errors: 0, Skipped: 0, Time elapsed: 0.018
sec
     [exec]     [junit] 
     [exec]     [junit] Testsuite: org.apache.tools.ant.types.PermissionsTest
     [exec]     [junit] Tests run: 6, Failures: 0, Errors: 0, Skipped: 0, Time elapsed: 0.026
sec
     [exec]     [junit] 
     [exec]     [junit] ------------- Standard Output ---------------
     [exec]     [junit] If this is the last line on standard out the testExit f.a.i.l.e.d
     [exec]     [junit] testExit successful.
     [exec]     [junit] ------------- ---------------- ---------------
     [exec]     [junit] Testsuite: org.apache.tools.ant.types.PolyTest
     [exec]     [junit] Tests run: 4, Failures: 0, Errors: 0, Skipped: 0, Time elapsed: 0.297
sec
     [exec]     [junit] 
     [exec]     [junit] Testsuite: org.apache.tools.ant.types.RedirectorElementTest
     [exec]     [junit] Tests run: 6, Failures: 0, Errors: 0, Skipped: 0, Time elapsed: 0.428
sec
     [exec]     [junit] 
     [exec]     [junit] Testsuite: org.apache.tools.ant.types.ResourceOutputTest
     [exec]     [junit] Tests run: 7, Failures: 0, Errors: 0, Skipped: 0, Time elapsed: 0.019
sec
     [exec]     [junit] 
     [exec]     [junit] Testsuite: org.apache.tools.ant.types.TarFileSetTest
     [exec]     [junit] Tests run: 3, Failures: 0, Errors: 0, Skipped: 0, Time elapsed: 0.002
sec
     [exec]     [junit] 
     [exec]     [junit] Testsuite: org.apache.tools.ant.types.XMLCatalogBuildFileTest
     [exec]     [junit] Tests run: 4, Failures: 0, Errors: 0, Skipped: 0, Time elapsed: 0.579
sec
     [exec]     [junit] 
     [exec]     [junit] Testsuite: org.apache.tools.ant.types.XMLCatalogTest
     [exec]     [junit] Tests run: 10, Failures: 0, Errors: 0, Skipped: 0, Time elapsed: 0.12
sec
     [exec]     [junit] 
     [exec]     [junit] Testsuite: org.apache.tools.ant.types.ZipFileSetTest
     [exec]     [junit] Tests run: 3, Failures: 0, Errors: 0, Skipped: 0, Time elapsed: 0.007
sec
     [exec]     [junit] 
     [exec]     [junit] Testsuite: org.apache.tools.ant.types.mappers.GlobMapperTest
     [exec]     [junit] Tests run: 1, Failures: 0, Errors: 0, Skipped: 0, Time elapsed: 0.069
sec
     [exec]     [junit] 
     [exec]     [junit] Testsuite: org.apache.tools.ant.types.mappers.RegexpPatternMapperTest
     [exec]     [junit] Tests run: 2, Failures: 0, Errors: 0, Skipped: 0, Time elapsed: 0.127
sec
     [exec]     [junit] 
     [exec]     [junit] Testsuite: org.apache.tools.ant.types.resources.FileResourceTest
     [exec]     [junit] Tests run: 9, Failures: 0, Errors: 0, Skipped: 0, Time elapsed: 0.007
sec
     [exec]     [junit] 
     [exec]     [junit] Testsuite: org.apache.tools.ant.types.resources.JavaResourceTest
     [exec]     [junit] Tests run: 3, Failures: 0, Errors: 0, Skipped: 0, Time elapsed: 0.062
sec
     [exec]     [junit] 
     [exec]     [junit] Testsuite: org.apache.tools.ant.types.resources.LazyResourceCollectionTest
     [exec]     [junit] Tests run: 2, Failures: 0, Errors: 0, Skipped: 0, Time elapsed: 0.007
sec
     [exec]     [junit] 
     [exec]     [junit] Testsuite: org.apache.tools.ant.types.resources.MultiRootFileSetTest
     [exec]     [junit] Tests run: 4, Failures: 0, Errors: 0, Skipped: 0, Time elapsed: 0.002
sec
     [exec]     [junit] 
     [exec]     [junit] Testsuite: org.apache.tools.ant.types.resources.ResourceListTest
     [exec]     [junit] Tests run: 2, Failures: 0, Errors: 0, Skipped: 0, Time elapsed: 0.003
sec
     [exec]     [junit] 
     [exec]     [junit] Testsuite: org.apache.tools.ant.types.resources.TarResourceTest
     [exec]     [junit] Tests run: 1, Failures: 0, Errors: 0, Skipped: 0, Time elapsed: 0.077
sec
     [exec]     [junit] 
     [exec]     [junit] Testsuite: org.apache.tools.ant.types.selectors.ContainsRegexpTest
     [exec]     [junit] Tests run: 1, Failures: 0, Errors: 0, Skipped: 0, Time elapsed: 0.057
sec
     [exec]     [junit] 
     [exec]     [junit] Testsuite: org.apache.tools.ant.types.selectors.ContainsSelectorTest
     [exec]     [junit] Tests run: 2, Failures: 0, Errors: 0, Skipped: 0, Time elapsed: 0.43
sec
     [exec]     [junit] 
     [exec]     [junit] Testsuite: org.apache.tools.ant.types.selectors.DateSelectorTest
     [exec]     [junit] Tests run: 2, Failures: 0, Errors: 0, Skipped: 0, Time elapsed: 0.276
sec
     [exec]     [junit] 
     [exec]     [junit] Testsuite: org.apache.tools.ant.types.selectors.DependSelectorTest
     [exec]     [junit] Tests run: 10, Failures: 0, Errors: 0, Skipped: 0, Time elapsed: 0.734
sec
     [exec]     [junit] 
     [exec]     [junit] Testsuite: org.apache.tools.ant.types.selectors.DepthSelectorTest
     [exec]     [junit] Tests run: 2, Failures: 0, Errors: 0, Skipped: 0, Time elapsed: 0.132
sec
     [exec]     [junit] 
     [exec]     [junit] Testsuite: org.apache.tools.ant.types.selectors.FilenameSelectorTest
     [exec]     [junit] Tests run: 2, Failures: 0, Errors: 0, Skipped: 0, Time elapsed: 0.201
sec
     [exec]     [junit] 
     [exec]     [junit] Testsuite: org.apache.tools.ant.types.selectors.PresentSelectorTest
     [exec]     [junit] Tests run: 2, Failures: 0, Errors: 0, Skipped: 0, Time elapsed: 0.137
sec
     [exec]     [junit] 
     [exec]     [junit] Testsuite: org.apache.tools.ant.types.selectors.SignedSelectorTest
     [exec]     [junit] Tests run: 3, Failures: 0, Errors: 0, Skipped: 0, Time elapsed: 0.239
sec
     [exec]     [junit] 
     [exec]     [junit] Testsuite: org.apache.tools.ant.types.selectors.SizeSelectorTest
     [exec]     [junit] Tests run: 6, Failures: 0, Errors: 0, Skipped: 0, Time elapsed: 0.555
sec
     [exec]     [junit] 
     [exec]     [junit] Testsuite: org.apache.tools.ant.types.selectors.TokenizedPatternTest
     [exec]     [junit] Tests run: 4, Failures: 0, Errors: 0, Skipped: 0, Time elapsed: 0.001
sec
     [exec]     [junit] 
     [exec]     [junit] Testsuite: org.apache.tools.ant.types.selectors.TypeSelectorTest
     [exec]     [junit] Tests run: 2, Failures: 0, Errors: 0, Skipped: 0, Time elapsed: 0.194
sec
     [exec]     [junit] 
     [exec]     [junit] Testsuite: org.apache.tools.ant.util.Base64ConverterTest
     [exec]     [junit] Tests run: 2, Failures: 0, Errors: 0, Skipped: 0, Time elapsed: 0.001
sec
     [exec]     [junit] 
     [exec]     [junit] Testsuite: org.apache.tools.ant.util.CollectionUtilsTest
     [exec]     [junit] Tests run: 2, Failures: 0, Errors: 0, Skipped: 0, Time elapsed: 0.005
sec
     [exec]     [junit] 
     [exec]     [junit] Testsuite: org.apache.tools.ant.util.DOMElementWriterTest
     [exec]     [junit] Tests run: 16, Failures: 0, Errors: 0, Skipped: 0, Time elapsed: 0.016
sec
     [exec]     [junit] 
     [exec]     [junit] Testsuite: org.apache.tools.ant.util.DateUtilsTest
     [exec]     [junit] Tests run: 7, Failures: 0, Errors: 0, Skipped: 0, Time elapsed: 0.041
sec
     [exec]     [junit] 
     [exec]     [junit] Testsuite: org.apache.tools.ant.util.DeweyDecimalTest
     [exec]     [junit] Tests run: 7, Failures: 0, Errors: 0, Skipped: 0, Time elapsed: 0.018
sec
     [exec]     [junit] 
     [exec]     [junit] Testsuite: org.apache.tools.ant.util.FileUtilsTest
     [exec]     [junit] Tests run: 13, Failures: 0, Errors: 0, Skipped: 1, Time elapsed: 0.046
sec
     [exec]     [junit] 
     [exec]     [junit] Testcase: testIsContextRelativePath(org.apache.tools.ant.util.FileUtilsTest):SKIPPED:
Test only runs on DOS
     [exec]     [junit] Testsuite: org.apache.tools.ant.util.GlobPatternMapperTest
     [exec]     [junit] Tests run: 4, Failures: 0, Errors: 0, Skipped: 0, Time elapsed: 0.007
sec
     [exec]     [junit] 
     [exec]     [junit] Testsuite: org.apache.tools.ant.util.JAXPUtilsTest
     [exec]     [junit] Tests run: 1, Failures: 0, Errors: 0, Skipped: 0, Time elapsed: 0.001
sec
     [exec]     [junit] 
     [exec]     [junit] Testsuite: org.apache.tools.ant.util.JavaEnvUtilsTest
     [exec]     [junit] Tests run: 4, Failures: 0, Errors: 0, Skipped: 2, Time elapsed: 0.002
sec
     [exec]     [junit] 
     [exec]     [junit] Testcase: testGetExecutableWindows(org.apache.tools.ant.util.JavaEnvUtilsTest):SKIPPED:
Test only runs on windows
     [exec]     [junit] Testcase: testGetExecutableNetware(org.apache.tools.ant.util.JavaEnvUtilsTest):SKIPPED:
Test only runs on netware
     [exec]     [junit] Testsuite: org.apache.tools.ant.util.LayoutPreservingPropertiesTest
     [exec]     [junit] Tests run: 9, Failures: 0, Errors: 0, Skipped: 0, Time elapsed: 0.081
sec
     [exec]     [junit] 
     [exec]     [junit] Testsuite: org.apache.tools.ant.util.LazyFileOutputStreamTest
     [exec]     [junit] Tests run: 4, Failures: 0, Errors: 0, Skipped: 0, Time elapsed: 0.002
sec
     [exec]     [junit] 
     [exec]     [junit] Testsuite: org.apache.tools.ant.util.LineOrientedOutputStreamTest
     [exec]     [junit] Tests run: 10, Failures: 0, Errors: 0, Skipped: 0, Time elapsed: 0.015
sec
     [exec]     [junit] 
     [exec]     [junit] Testsuite: org.apache.tools.ant.util.LinkedHashtableTest
     [exec]     [junit] Tests run: 12, Failures: 0, Errors: 0, Skipped: 0, Time elapsed: 0.008
sec
     [exec]     [junit] 
     [exec]     [junit] Testsuite: org.apache.tools.ant.util.LoaderUtilsTest
     [exec]     [junit] Tests run: 1, Failures: 0, Errors: 0, Skipped: 0, Time elapsed: 0.001
sec
     [exec]     [junit] 
     [exec]     [junit] Testsuite: org.apache.tools.ant.util.PackageNameMapperTest
     [exec]     [junit] Tests run: 1, Failures: 0, Errors: 0, Skipped: 0, Time elapsed: 0.001
sec
     [exec]     [junit] 
     [exec]     [junit] Testsuite: org.apache.tools.ant.util.ReaderInputStreamTest
     [exec]     [junit] Tests run: 6, Failures: 0, Errors: 0, Skipped: 0, Time elapsed: 0.011
sec
     [exec]     [junit] 
     [exec]     [junit] ------------- Standard Output ---------------
     [exec]     [junit] Preample len is 0
     [exec]     [junit] ------------- ---------------- ---------------
     [exec]     [junit] Testsuite: org.apache.tools.ant.util.ResourceUtilsTest
     [exec]     [junit] Tests run: 1, Failures: 0, Errors: 0, Skipped: 0, Time elapsed: 0.006
sec
     [exec]     [junit] 
     [exec]     [junit] Testsuite: org.apache.tools.ant.util.StringUtilsTest
     [exec]     [junit] Tests run: 15, Failures: 0, Errors: 0, Skipped: 0, Time elapsed: 0.036
sec
     [exec]     [junit] 
     [exec]     [junit] Testsuite: org.apache.tools.ant.util.SymlinkUtilsTest
     [exec]     [junit] Tests run: 1, Failures: 0, Errors: 0, Skipped: 0, Time elapsed: 0.001
sec
     [exec]     [junit] 
     [exec]     [junit] Testsuite: org.apache.tools.ant.util.UnPackageNameMapperTest
     [exec]     [junit] Tests run: 1, Failures: 0, Errors: 0, Skipped: 0, Time elapsed: 0.002
sec
     [exec]     [junit] 
     [exec]     [junit] Testsuite: org.apache.tools.ant.util.UnicodeUtilTest
     [exec]     [junit] Tests run: 1, Failures: 0, Errors: 0, Skipped: 0, Time elapsed: 0.001
sec
     [exec]     [junit] 
     [exec]     [junit] Testsuite: org.apache.tools.ant.util.VectorSetTest
     [exec]     [junit] Tests run: 25, Failures: 0, Errors: 0, Skipped: 0, Time elapsed: 5.228
sec
     [exec]     [junit] 
     [exec]     [junit] Testsuite: org.apache.tools.ant.util.XMLFragmentTest
     [exec]     [junit] Tests run: 2, Failures: 0, Errors: 0, Skipped: 0, Time elapsed: 0.059
sec
     [exec]     [junit] 
     [exec]     [junit] Testsuite: org.apache.tools.ant.util.facade.FacadeTaskHelperTest
     [exec]     [junit] Tests run: 2, Failures: 0, Errors: 0, Skipped: 0, Time elapsed: 0.001
sec
     [exec]     [junit] 
     [exec]     [junit] Testsuite: org.apache.tools.ant.util.facade.ImplementationSpecificArgumentTest
     [exec]     [junit] Tests run: 1, Failures: 0, Errors: 0, Skipped: 0, Time elapsed: 0.001
sec
     [exec]     [junit] 
     [exec]     [junit] Testsuite: org.apache.tools.ant.util.regexp.Jdk14RegexpMatcherTest
     [exec]     [junit] Tests run: 12, Failures: 0, Errors: 0, Skipped: 0, Time elapsed: 0.005
sec
     [exec]     [junit] 
     [exec]     [junit] Testsuite: org.apache.tools.ant.util.regexp.Jdk14RegexpRegexpTest
     [exec]     [junit] Tests run: 15, Failures: 0, Errors: 0, Skipped: 0, Time elapsed: 0.005
sec
     [exec]     [junit] 
     [exec]     [junit] Testsuite: org.apache.tools.bzip2.BlockSortTest
     [exec]     [junit] Tests run: 7, Failures: 0, Errors: 0, Skipped: 0, Time elapsed: 0.007
sec
     [exec]     [junit] 
     [exec]     [junit] Testsuite: org.apache.tools.bzip2.CBZip2StreamTest
     [exec]     [junit] Tests run: 2, Failures: 0, Errors: 0, Skipped: 0, Time elapsed: 0.003
sec
     [exec]     [junit] 
     [exec]     [junit] Testsuite: org.apache.tools.mail.MailMessageTest
     [exec]     [junit] Tests run: 7, Failures: 0, Errors: 0, Skipped: 0, Time elapsed: 10.62
sec
     [exec]     [junit] 
     [exec]     [junit] Testsuite: org.apache.tools.tar.TarEntryTest
     [exec]     [junit] Tests run: 1, Failures: 0, Errors: 0, Skipped: 0, Time elapsed: 0.002
sec
     [exec]     [junit] 
     [exec]     [junit] Testsuite: org.apache.tools.tar.TarOutputStreamTest
     [exec]     [junit] Tests run: 1, Failures: 0, Errors: 0, Skipped: 0, Time elapsed: 0.001
sec
     [exec]     [junit] 
     [exec]     [junit] Testsuite: org.apache.tools.tar.TarRoundTripTest
     [exec]     [junit] Tests run: 2, Failures: 0, Errors: 0, Skipped: 0, Time elapsed: 0.038
sec
     [exec]     [junit] 
     [exec]     [junit] Testsuite: org.apache.tools.zip.AsiExtraFieldTest
     [exec]     [junit] Tests run: 4, Failures: 0, Errors: 0, Skipped: 0, Time elapsed: 0.002
sec
     [exec]     [junit] 
     [exec]     [junit] Testsuite: org.apache.tools.zip.ExtraFieldUtilsTest
     [exec]     [junit] Tests run: 5, Failures: 0, Errors: 0, Skipped: 0, Time elapsed: 0.007
sec
     [exec]     [junit] 
     [exec]     [junit] Testsuite: org.apache.tools.zip.UTF8ZipFilesTest
     [exec]     [junit] Tests run: 9, Failures: 0, Errors: 0, Skipped: 0, Time elapsed: 0.084
sec
     [exec]     [junit] 
     [exec]     [junit] Testsuite: org.apache.tools.zip.ZipEncodingTest
     [exec]     [junit] Tests run: 3, Failures: 0, Errors: 0, Skipped: 0, Time elapsed: 0.007
sec
     [exec]     [junit] 
     [exec]     [junit] Testsuite: org.apache.tools.zip.ZipEntryTest
     [exec]     [junit] Tests run: 5, Failures: 0, Errors: 0, Skipped: 0, Time elapsed: 0.002
sec
     [exec]     [junit] 
     [exec]     [junit] Testsuite: org.apache.tools.zip.ZipLongTest
     [exec]     [junit] Tests run: 5, Failures: 0, Errors: 0, Skipped: 0, Time elapsed: 0.005
sec
     [exec]     [junit] 
     [exec]     [junit] Testsuite: org.apache.tools.zip.ZipOutputStreamTest
     [exec]     [junit] Tests run: 2, Failures: 0, Errors: 0, Skipped: 0, Time elapsed: 0.001
sec
     [exec]     [junit] 
     [exec]     [junit] Testsuite: org.apache.tools.zip.ZipShortTest
     [exec]     [junit] Tests run: 5, Failures: 0, Errors: 0, Skipped: 0, Time elapsed: 0.009
sec
     [exec]     [junit] 
     [exec] 
     [exec] junit-single-test-only:
     [exec] 
     [exec] junit-single-test:
     [exec] 
     [exec] junit-tests:
     [exec] 
     [exec] junit-report-only:
     [exec]     [mkdir] Created dir: <https://builds.apache.org/job/Ant-Build-Matrix/jdk=Open%20JDK%201.8%20(Only%20on%20ubuntu%20nodes),label=Ubuntu/ws/build/testcases/reports>
     [exec] [junitreport] Processing <https://builds.apache.org/job/Ant-Build-Matrix/jdk=Open%20JDK%201.8%20(Only%20on%20ubuntu%20nodes),label=Ubuntu/ws/build/testcases/reports/TESTS-TestSuites.xml>
to /tmp/null1380110850
     [exec] [junitreport] Loading stylesheet jar:<https://builds.apache.org/job/Ant-Build-Matrix/jdk=Open%20JDK%201.8%20(Only%20on%20ubuntu%20nodes),label=Ubuntu/ws/bootstrap/lib/ant-junit.jar!/org/apache/tools/ant/taskdefs/optional/junit/xsl/junit-frames.xsl>
     [exec] [junitreport] : Error! Could not compile stylesheet
     [exec] [junitreport] : Fatal Error! Stream closed Cause: java.io.IOException: Stream
closed
     [exec] [junitreport] Failed to process <https://builds.apache.org/job/Ant-Build-Matrix/jdk=Open%20JDK%201.8%20(Only%20on%20ubuntu%20nodes),label=Ubuntu/ws/build/testcases/reports/TESTS-TestSuites.xml>
     [exec] 
     [exec] BUILD FAILED
     [exec] <https://builds.apache.org/job/Ant-Build-Matrix/jdk=Open%20JDK%201.8%20(Only%20on%20ubuntu%20nodes),label=Ubuntu/ws/build.xml>:1756:
Errors while applying transformations: Fatal error during transformation using jar:<https://builds.apache.org/job/Ant-Build-Matrix/jdk=Open%20JDK%201.8%20(Only%20on%20ubuntu%20nodes),label=Ubuntu/ws/bootstrap/lib/ant-junit.jar!/org/apache/tools/ant/taskdefs/optional/junit/xsl/junit-frames.xsl>:
Stream closed
     [exec] 
     [exec] Total time: 7 minutes 11 seconds

BUILD FAILED
<https://builds.apache.org/job/Ant-Build-Matrix/jdk=Open%20JDK%201.8%20(Only%20on%20ubuntu%20nodes),label=Ubuntu/ws/launch-build.xml>:36:
exec returned: 1

Total time: 8 minutes 26 seconds
Build step 'Invoke Ant' marked build as failure
Recording test results

Mime
View raw message