ant-notifications mailing list archives

Site index · List index
Message view « Date » · « Thread »
Top « Date » · « Thread »
From Apache Jenkins Server <jenk...@builds.apache.org>
Subject Build failed in Jenkins: AntLib-compress #8
Date Sun, 06 Jul 2014 19:19:39 GMT
See <https://builds.apache.org/job/AntLib-compress/8/>

------------------------------------------
[...truncated 927 lines...]
[au:antunit] 	Target: testLevel  FAILED
[au:antunit] 	at line 365, column 20
[au:antunit] 	Message: Assertion failed
[au:antunit] 	took 0.025 sec
[au:antunit]  caused an ERROR
[au:antunit] 	at line 27, column 30
[au:antunit] 	Message: Unable to delete file C:\Windows\TEMP\testoutput\test.zip
[au:antunit] 	Target: testImplicitDirectoriesUsePermissions  caused an ERROR
[au:antunit] 	at line 186, column 51
[au:antunit] 	Message: Problem reading C:\Windows\TEMP\testoutput\test.zip
[au:antunit] 	took 0.016 sec
[au:antunit]  caused an ERROR
[au:antunit] 	at line 27, column 30
[au:antunit] 	Message: Unable to delete file C:\Windows\TEMP\testoutput\test.zip
[au:antunit] 	Target: testReplaceOfOutOfDate  caused an ERROR
[au:antunit] 	at line 455, column 29
[au:antunit] 	Message: Problem reading C:\Windows\TEMP\testoutput\test.zip
[au:antunit] 	took 0.028 sec
[au:antunit]  caused an ERROR
[au:antunit] 	at line 27, column 30
[au:antunit] 	Message: Unable to delete file C:\Windows\TEMP\testoutput\test.zip
[au:antunit] 	Target: testRoundDown  caused an ERROR
[au:antunit] 	at line 314, column 49
[au:antunit] 	Message: Problem reading C:\Windows\TEMP\testoutput\test.zip
[au:antunit] 	took 0.015 sec
[au:antunit]  caused an ERROR
[au:antunit] 	at line 27, column 30
[au:antunit] 	Message: Unable to delete file C:\Windows\TEMP\testoutput\test.zip
[au:antunit] 	Target: testUpdateOfUpToDate  caused an ERROR
[au:antunit] 	at line 455, column 29
[au:antunit] 	Message: Problem reading C:\Windows\TEMP\testoutput\test.zip
[au:antunit] 	took 0.027 sec
[au:antunit]  caused an ERROR
[au:antunit] 	at line 27, column 30
[au:antunit] 	Message: Unable to delete file C:\Windows\TEMP\testoutput\test.zip
[au:antunit] 	Target: testUpdateOfOutOfDate  caused an ERROR
[au:antunit] 	at line 455, column 29
[au:antunit] 	Message: Problem reading C:\Windows\TEMP\testoutput\test.zip
[au:antunit] 	took 0.027 sec
[au:antunit]  caused an ERROR
[au:antunit] 	at line 27, column 30
[au:antunit] 	Message: Unable to delete file C:\Windows\TEMP\testoutput\test.zip
[au:antunit] 	Target: testSkipEmpty  FAILED
[au:antunit] 	at line 430, column 47
[au:antunit] 	Message: Didn't expect file 'C:\Windows\TEMP\testoutput\test.zip' to exist
[au:antunit] 	took 0.016 sec
[au:antunit]  caused an ERROR
[au:antunit] 	at line 27, column 30
[au:antunit] 	Message: Unable to delete file C:\Windows\TEMP\testoutput\test.zip
[au:antunit] 	Target: testWithDirectories  caused an ERROR
[au:antunit] 	at line 140, column 51
[au:antunit] 	Message: Problem reading C:\Windows\TEMP\testoutput\test.zip
[au:antunit] 	took 0.018 sec
[au:antunit]  caused an ERROR
[au:antunit] 	at line 27, column 30
[au:antunit] 	Message: Unable to delete file C:\Windows\TEMP\testoutput\test.zip
[au:antunit] 	Target: testFullpath  caused an ERROR
[au:antunit] 	at line 208, column 33
[au:antunit] 	Message: Problem reading C:\Windows\TEMP\testoutput\test.zip
[au:antunit] 	took 0.014 sec
[au:antunit]  caused an ERROR
[au:antunit] 	at line 27, column 30
[au:antunit] 	Message: Unable to delete file C:\Windows\TEMP\testoutput\test.zip
[au:antunit] 	Target: testPreserve0Permissions  caused an ERROR
[au:antunit] 	at line 306, column 61
[au:antunit] 	Message: Problem reading C:\Windows\TEMP\testoutput\test.zip
[au:antunit] 	took 0.076 sec
[au:antunit]  caused an ERROR
[au:antunit] 	at line 27, column 30
[au:antunit] 	Message: Unable to delete file C:\Windows\TEMP\testoutput\test.zip
[au:antunit] 	Target: testForceCreateOfUpToDate  caused an ERROR
[au:antunit] 	at line 455, column 29
[au:antunit] 	Message: Problem reading C:\Windows\TEMP\testoutput\test.zip
[au:antunit] 	took 0.031 sec
[au:antunit]  caused an ERROR
[au:antunit] 	at line 27, column 30
[au:antunit] 	Message: Unable to delete file C:\Windows\TEMP\testoutput\test.zip
[au:antunit] 	Target: testNoDirectoriesByDefault  caused an ERROR
[au:antunit] 	at line 123, column 33
[au:antunit] 	Message: Problem reading C:\Windows\TEMP\testoutput\test.zip
[au:antunit] 	took 0.017 sec
[au:antunit]  caused an ERROR
[au:antunit] 	at line 27, column 30
[au:antunit] 	Message: Unable to delete file C:\Windows\TEMP\testoutput\test.zip
[au:antunit] 	Target: testPlainFileSet  caused an ERROR
[au:antunit] 	at line 60, column 33
[au:antunit] 	Message: Problem reading C:\Windows\TEMP\testoutput\test.zip
[au:antunit] 	took 0.017 sec
[au:antunit]  caused an ERROR
[au:antunit] 	at line 27, column 30
[au:antunit] 	Message: Unable to delete file C:\Windows\TEMP\testoutput\test.zip
[au:antunit] 	Target: testReplaceOfUpToDate  caused an ERROR
[au:antunit] 	at line 455, column 29
[au:antunit] 	Message: Problem reading C:\Windows\TEMP\testoutput\test.zip
[au:antunit] 	took 0.097 sec
[au:antunit]  caused an ERROR
[au:antunit] 	at line 27, column 30
[au:antunit] 	Message: Unable to delete file C:\Windows\TEMP\testoutput\test.zip
[au:antunit] 	Target: testCoreZipFileSet  caused an ERROR
[au:antunit] 	at line 67, column 33
[au:antunit] 	Message: Problem reading C:\Windows\TEMP\testoutput\test.zip
[au:antunit] 	took 0.015 sec
[au:antunit]  caused an ERROR
[au:antunit] 	at line 27, column 30
[au:antunit] 	Message: Unable to delete file C:\Windows\TEMP\testoutput\test.zip
[au:antunit] 	Target: testAntlibTarFileSet  caused an ERROR
[au:antunit] 	at line 96, column 33
[au:antunit] 	Message: Problem reading C:\Windows\TEMP\testoutput\test.zip
[au:antunit] 	took 0.017 sec
[au:antunit]  caused an ERROR
[au:antunit] 	at line 27, column 30
[au:antunit] 	Message: Unable to delete file C:\Windows\TEMP\testoutput\test.zip
[au:antunit] 	Target: testCreateOfOutOfDate  caused an ERROR
[au:antunit] 	at line 455, column 29
[au:antunit] 	Message: Problem reading C:\Windows\TEMP\testoutput\test.zip
[au:antunit] 	took 0.027 sec
[au:antunit]  caused an ERROR
[au:antunit] 	at line 27, column 30
[au:antunit] 	Message: Unable to delete file C:\Windows\TEMP\testoutput\test.zip
[au:antunit] 	Target: testFileSetPermissionsWin  caused an ERROR
[au:antunit] 	at line 199, column 33
[au:antunit] 	Message: Problem reading C:\Windows\TEMP\testoutput\test.zip
[au:antunit] 	took 0.016 sec
[au:antunit]  caused an ERROR
[au:antunit] 	at line 27, column 30
[au:antunit] 	Message: Unable to delete file C:\Windows\TEMP\testoutput\test.zip
[au:antunit] 	Target: testAddDuplicates  caused an ERROR
[au:antunit] 	at line 388, column 49
[au:antunit] 	Message: Problem reading C:\Windows\TEMP\testoutput\test.zip
[au:antunit] 	took 0.014 sec
[au:antunit]  caused an ERROR
[au:antunit] 	at line 27, column 30
[au:antunit] 	Message: Unable to delete file C:\Windows\TEMP\testoutput\test.zip
[au:antunit] 	Target: testRemoveLeadingSlashes  caused an ERROR
[au:antunit] 	at line 323, column 33
[au:antunit] 	Message: Problem reading C:\Windows\TEMP\testoutput\test.zip
[au:antunit] 	took 0.023 sec
[au:antunit]  caused an ERROR
[au:antunit] 	at line 27, column 30
[au:antunit] 	Message: Unable to delete file C:\Windows\TEMP\testoutput\test.zip
[au:antunit] 	Target: testPrefixWithSlash  caused an ERROR
[au:antunit] 	at line 226, column 33
[au:antunit] 	Message: Problem reading C:\Windows\TEMP\testoutput\test.zip
[au:antunit] 	took 0.013 sec
[au:antunit]  caused an ERROR
[au:antunit] 	at line 27, column 30
[au:antunit] 	Message: Unable to delete file C:\Windows\TEMP\testoutput\test.zip
[au:antunit] 	Target: testWithImplicitDirectories  caused an ERROR
[au:antunit] 	at line 163, column 51
[au:antunit] 	Message: Problem reading C:\Windows\TEMP\testoutput\test.zip
[au:antunit] 	took 0.013 sec
[au:antunit]  caused an ERROR
[au:antunit] 	at line 27, column 30
[au:antunit] 	Message: Unable to delete file C:\Windows\TEMP\testoutput\test.zip
[au:antunit] 	Target: testForceReplaceOfUpToDate  caused an ERROR
[au:antunit] 	at line 455, column 29
[au:antunit] 	Message: Problem reading C:\Windows\TEMP\testoutput\test.zip
[au:antunit] 	took 0.021 sec
[au:antunit]  caused an ERROR
[au:antunit] 	at line 27, column 30
[au:antunit] 	Message: Unable to delete file C:\Windows\TEMP\testoutput\test.zip
[au:antunit] 	Target: test0PermissionsGetReplaced  caused an ERROR
[au:antunit] 	at line 297, column 33
[au:antunit] 	Message: Problem reading C:\Windows\TEMP\testoutput\test.zip
[au:antunit] 	took 0.014 sec
[au:antunit]  caused an ERROR
[au:antunit] 	at line 27, column 30
[au:antunit] 	Message: Unable to delete file C:\Windows\TEMP\testoutput\test.zip
[au:antunit] 	Target: testFailDuplicates took 0.01 sec
[au:antunit]  caused an ERROR
[au:antunit] 	at line 27, column 30
[au:antunit] 	Message: Unable to delete file C:\Windows\TEMP\testoutput\test.zip
[au:antunit] 	
[au:antunit] Build File: <https://builds.apache.org/job/AntLib-compress/ws/src\tests\antunit\zipentry-test.xml>
[au:antunit] Tests run: 3, Failures: 0, Errors: 3, Time elapsed: 0.304 sec
[au:antunit] Target: testResourceProperties took 0.04 sec
[au:antunit]  caused an ERROR
[au:antunit] 	at line 27, column 30
[au:antunit] 	Message: Unable to delete file C:\Windows\TEMP\testoutput\test.zip
[au:antunit] 	Target: testUncompressSource took 0.03 sec
[au:antunit]  caused an ERROR
[au:antunit] 	at line 27, column 30
[au:antunit] 	Message: Unable to delete file C:\Windows\TEMP\testoutput\test.zip
[au:antunit] 	Target: testZipSource took 0.009 sec
[au:antunit]  caused an ERROR
[au:antunit] 	at line 27, column 30
[au:antunit] 	Message: Unable to delete file C:\Windows\TEMP\testoutput\test.zip
[au:antunit] 	
[au:antunit] Build File: <https://builds.apache.org/job/AntLib-compress/ws/src\tests\antunit\zipfileset-test.xml>
Cleaning up unclosed ZipFile for archive <https://builds.apache.org/job/AntLib-compress/ws/src\tests\resources\password-encrypted.zip>
[au:antunit] Tests run: 9, Failures: 0, Errors: 9, Time elapsed: 0.674 sec
[au:antunit] Target: testSkipUnreadableEntries took 0.011 sec
[au:antunit]  caused an ERROR
[au:antunit] 	at line 27, column 30
[au:antunit] 	Message: Unable to delete file C:\Windows\TEMP\testoutput\test.zip
[au:antunit] 	Target: testMissingArchive took 0.007 sec
[au:antunit]  caused an ERROR
[au:antunit] 	at line 27, column 30
[au:antunit] 	Message: Unable to delete file C:\Windows\TEMP\testoutput\test.zip
[au:antunit] 	Target: testUncompressSource took 0.013 sec
[au:antunit]  caused an ERROR
[au:antunit] 	at line 27, column 30
[au:antunit] 	Message: Unable to delete file C:\Windows\TEMP\testoutput\test.zip
[au:antunit] 	Target: test-refid-check-encoding took 0.007 sec
[au:antunit]  caused an ERROR
[au:antunit] 	at line 27, column 30
[au:antunit] 	Message: Unable to delete file C:\Windows\TEMP\testoutput\test.zip
[au:antunit] 	Target: testZipSource took 0.006 sec
[au:antunit]  caused an ERROR
[au:antunit] 	at line 27, column 30
[au:antunit] 	Message: Unable to delete file C:\Windows\TEMP\testoutput\test.zip
[au:antunit] 	Target: test-refid-modify took 0.052 sec
[au:antunit]  caused an ERROR
[au:antunit] 	at line 27, column 30
[au:antunit] 	Message: Unable to delete file C:\Windows\TEMP\testoutput\test.zip
[au:antunit] 	Target: test-refid-check-prefix took 0.005 sec
[au:antunit]  caused an ERROR
[au:antunit] 	at line 27, column 30
[au:antunit] 	Message: Unable to delete file C:\Windows\TEMP\testoutput\test.zip
[au:antunit] 	Target: testMissingArchiveDoesntMatter took 0.005 sec
[au:antunit]  caused an ERROR
[au:antunit] 	at line 27, column 30
[au:antunit] 	Message: Unable to delete file C:\Windows\TEMP\testoutput\test.zip
[au:antunit] 	Target: testFailsOnUnreadableEntries took 0.007 sec
[au:antunit]  caused an ERROR
[au:antunit] 	at line 27, column 30
[au:antunit] 	Message: Unable to delete file C:\Windows\TEMP\testoutput\test.zip
[au:antunit] 	
[au:antunit] Build File: <https://builds.apache.org/job/AntLib-compress/ws/src\tests\antunit\zresource-test.xml>
[au:antunit] Tests run: 1, Failures: 0, Errors: 1, Time elapsed: 0.064 sec
[au:antunit] Target: testNativeZ took 0.008 sec
[au:antunit]  caused an ERROR
[au:antunit] 	at line 27, column 30
[au:antunit] 	Message: Unable to delete file C:\Windows\TEMP\testoutput\test.zip
[au:antunit] 	

test:

BUILD FAILED
<https://builds.apache.org/job/AntLib-compress/ws/common\build.xml>:209: At least one
AntUnit test has failed.

Total time: 3 minutes 25 seconds
Build step 'Invoke Ant' marked build as failure
[WARNINGS] Skipping publisher since build result is FAILURE
[TASKS] Skipping publisher since build result is FAILURE
Archiving artifacts
No prior successful build to compare, so performing full copy of artifacts
Recording test results
Publishing Javadoc

Mime
View raw message