ant-notifications mailing list archives

Site index · List index
Message view « Date » · « Thread »
Top « Date » · « Thread »
From Apache Jenkins Server <jenk...@builds.apache.org>
Subject Build failed in Jenkins: AntLib-compress #6
Date Sun, 06 Jul 2014 19:07:38 GMT
See <https://builds.apache.org/job/AntLib-compress/6/>

------------------------------------------
Started by user jhm
Building remotely on windows2 (Windows) in workspace <https://builds.apache.org/job/AntLib-compress/ws/>
 > git rev-parse --is-inside-work-tree
Fetching changes from the remote Git repository
 > git config remote.origin.url https://git-wip-us.apache.org/repos/asf/ant-antlibs-compress.git
Fetching upstream changes from https://git-wip-us.apache.org/repos/asf/ant-antlibs-compress.git
 > git --version
 > git fetch --tags --progress https://git-wip-us.apache.org/repos/asf/ant-antlibs-compress.git
+refs/heads/*:refs/remotes/origin/*
 > git rev-parse "origin/master^{commit}"
Checking out Revision e2fa62db4667e39f7b9e880f1f9208f051fb50a6 (origin/master)
 > git config core.sparsecheckout
 > git checkout -f e2fa62db4667e39f7b9e880f1f9208f051fb50a6
 > git rev-list e2fa62db4667e39f7b9e880f1f9208f051fb50a6
 > git remote
 > git submodule init
 > git submodule sync
 > git config --get remote.origin.url
 > git submodule update --init --recursive
[AntLib-compress] $ cmd.exe /C '"f:\jenkins\jenkins-slave\tools\hudson.tasks.Ant_AntInstallation\ant-1.9.3\bin\ant.bat
-file prepare.xml update-prepare-script && exit %%ERRORLEVEL%%"'
Unable to locate tools.jar. Expected to find it in C:\Program Files\Java\jre7\lib\tools.jar
Buildfile: <https://builds.apache.org/job/AntLib-compress/ws/prepare.xml>

update-prepare-script:
     [echo] updating prepare.xml

BUILD SUCCESSFUL
Total time: 0 seconds
[AntLib-compress] $ cmd.exe /C '"f:\jenkins\jenkins-slave\tools\hudson.tasks.Ant_AntInstallation\ant-1.9.3\bin\ant.bat
clean distribution && exit %%ERRORLEVEL%%"'
Unable to locate tools.jar. Expected to find it in C:\Program Files\Java\jre7\lib\tools.jar
Buildfile: <https://builds.apache.org/job/AntLib-compress/ws/build.xml>

setup-properties:

clean:

setup-properties:

setup:
    [mkdir] Created dir: <https://builds.apache.org/job/AntLib-compress/ws/build\classes>
    [mkdir] Created dir: <https://builds.apache.org/job/AntLib-compress/ws/build\test-classes>
    [mkdir] Created dir: <https://builds.apache.org/job/AntLib-compress/ws/build\lib>
     [copy] Copying 1 file to <https://builds.apache.org/job/AntLib-compress/ws/docs>

download-ivy:
    [mkdir] Created dir: <https://builds.apache.org/job/AntLib-compress/ws/ivy>
     [echo] installing ivy...
      [get] Getting: http://repo1.maven.org/maven2/org/apache/ivy/ivy/2.4.0-rc1/ivy-2.4.0-rc1.jar
      [get] To: <https://builds.apache.org/job/AntLib-compress/ws/ivy\ivy.jar>

install-ivy:

-no-resolve:

resolve:
[ivy:resolve] :: Apache Ivy 2.4.0-rc1 - 20140315220245 :: http://ant.apache.org/ivy/ ::
[ivy:resolve] :: loading settings :: url = jar:<https://builds.apache.org/job/AntLib-compress/ws/ivy/ivy.jar!/org/apache/ivy/core/settings/ivysettings.xml>
[ivy:resolve] :: resolving dependencies :: Apache Ant#ant-compress;1.5Alpha
[ivy:resolve] 	confs: [default, test]
[ivy:resolve] 	found org.apache.commons#commons-compress;1.8 in public
[ivy:resolve] 	found org.tukaani#xz;1.5 in public
[ivy:resolve] 	found junit#junit;4.11 in public
[ivy:resolve] 	found org.hamcrest#hamcrest-core;1.3 in public
[ivy:resolve] downloading http://repo1.maven.org/maven2/org/apache/commons/commons-compress/1.8/commons-compress-1.8.jar
...
[ivy:resolve] ......... (356kB)
[ivy:resolve] .. (0kB)
[ivy:resolve] 	[SUCCESSFUL ] org.apache.commons#commons-compress;1.8!commons-compress.jar
(487ms)
[ivy:resolve] downloading http://repo1.maven.org/maven2/org/tukaani/xz/1.5/xz-1.5.jar ...
[ivy:resolve] ... (97kB)
[ivy:resolve] .. (0kB)
[ivy:resolve] 	[SUCCESSFUL ] org.tukaani#xz;1.5!xz.jar (319ms)
[ivy:resolve] downloading http://repo1.maven.org/maven2/junit/junit/4.11/junit-4.11.jar ...
[ivy:resolve] ...... (239kB)
[ivy:resolve] .. (0kB)
[ivy:resolve] 	[SUCCESSFUL ] junit#junit;4.11!junit.jar (367ms)
[ivy:resolve] downloading http://repo1.maven.org/maven2/org/hamcrest/hamcrest-core/1.3/hamcrest-core-1.3.jar
...
[ivy:resolve] .. (43kB)
[ivy:resolve] .. (0kB)
[ivy:resolve] 	[SUCCESSFUL ] org.hamcrest#hamcrest-core;1.3!hamcrest-core.jar (315ms)
[ivy:resolve] :: resolution report :: resolve 6517ms :: artifacts dl 1509ms
	---------------------------------------------------------------------
	|                  |            modules            ||   artifacts   |
	|       conf       | number| search|dwnlded|evicted|| number|dwnlded|
	---------------------------------------------------------------------
	|      default     |   2   |   2   |   2   |   0   ||   2   |   2   |
	|       test       |   2   |   2   |   2   |   0   ||   2   |   2   |
	---------------------------------------------------------------------
[ivy:retrieve] :: retrieving :: Apache Ant#ant-compress [sync]
[ivy:retrieve] 	confs: [default]
[ivy:retrieve] 	2 artifacts copied, 0 already retrieved (453kB/9ms)
[ivy:retrieve] :: retrieving :: Apache Ant#ant-compress [sync]
[ivy:retrieve] 	confs: [test]
[ivy:retrieve] 	2 artifacts copied, 0 already retrieved (283kB/8ms)

compile:

BUILD FAILED
<https://builds.apache.org/job/AntLib-compress/ws/common\build.xml>:72: Unable to find
a javac compiler;
com.sun.tools.javac.Main is not on the classpath.
Perhaps JAVA_HOME does not point to the JDK.
It is currently set to "C:\Program Files\Java\jre7"

Total time: 12 seconds
Build step 'Invoke Ant' marked build as failure
[WARNINGS] Skipping publisher since build result is FAILURE
[TASKS] Skipping publisher since build result is FAILURE
Archiving artifacts
Recording test results
Publishing Javadoc

Mime
View raw message