ant-notifications mailing list archives

Site index · List index
Message view « Date » · « Thread »
Top « Date » · « Thread »
From Apache Jenkins Server <jenk...@builds.apache.org>
Subject Build failed in Jenkins: IvyDE-updatesite #737
Date Thu, 03 Jul 2014 20:44:06 GMT
See <https://builds.apache.org/job/IvyDE-updatesite/737/>

------------------------------------------
Started by upstream project "Ivy" build number 491
originally caused by:
 Started by an SCM change
Building remotely on ubuntu5 (Ubuntu ubuntu) in workspace <https://builds.apache.org/job/IvyDE-updatesite/ws/>
Updating http://svn.apache.org/repos/asf/ant/ivy/updatesite/trunk at revision '2014-07-03T20:43:48.311
+0000'
Fetching 'https://dist.apache.org/repos/dist/dev/ant/ivyde/updatesite' at -1 into '<https://builds.apache.org/job/IvyDE-updatesite/ws/trunk/dist/dev'>
At revision 5741
Fetching 'https://dist.apache.org/repos/dist/release/ant/ivyde/updatesite' at -1 into '<https://builds.apache.org/job/IvyDE-updatesite/ws/trunk/dist/release'>
At revision 5741
At revision 1607745
no change for http://svn.apache.org/repos/asf/ant/ivy/updatesite/trunk since the previous
build
no change for https://dist.apache.org/repos/dist/dev/ant/ivyde/updatesite since the previous
build
no change for https://dist.apache.org/repos/dist/release/ant/ivyde/updatesite since the previous
build
[locks-and-latches] Checking to see if we really have the locks
[locks-and-latches] Have all the locks, build can start
[trunk] $ /home/hudson/tools/ant/apache-ant-1.8.1/bin/ant jenkins-prepare
Buildfile: <https://builds.apache.org/job/IvyDE-updatesite/ws/trunk/build.xml>

jenkins-check-download-sdk:

jenkins-get-sdk:

jenkins-check-unzip-eclipse:

jenkins-unzip-eclipse:

jenkins-prepare-eclipse:

jenkins-prepare:

BUILD SUCCESSFUL
Total time: 1 second
[trunk] $ /home/hudson/tools/ant/apache-ant-1.8.1/bin/ant jenkins-build
Buildfile: <https://builds.apache.org/job/IvyDE-updatesite/ws/trunk/build.xml>

clean:

jenkins-find-ivy-jar:
      [get] Getting: http://builds.apache.org//job/Ivy/lastSuccessfulBuild/artifact/trunk/build/artifact/jars/ivy.jar
      [get] To: <https://builds.apache.org/job/IvyDE-updatesite/ws/trunk/dependencies/ivy-jenkins.jar>
      [get] http://builds.apache.org//job/Ivy/lastSuccessfulBuild/artifact/trunk/build/artifact/jars/ivy.jar
moved to https://builds.apache.org/job/Ivy/lastSuccessfulBuild/artifact/trunk/build/artifact/jars/ivy.jar
      [get] Error opening connection java.io.FileNotFoundException: https://builds.apache.org/job/Ivy/lastSuccessfulBuild/artifact/trunk/build/artifact/jars/ivy.jar
      [get] Error opening connection java.io.FileNotFoundException: https://builds.apache.org/job/Ivy/lastSuccessfulBuild/artifact/trunk/build/artifact/jars/ivy.jar
      [get] Error opening connection java.io.FileNotFoundException: https://builds.apache.org/job/Ivy/lastSuccessfulBuild/artifact/trunk/build/artifact/jars/ivy.jar
      [get] Can't get http://builds.apache.org//job/Ivy/lastSuccessfulBuild/artifact/trunk/build/artifact/jars/ivy.jar
to <https://builds.apache.org/job/IvyDE-updatesite/ws/trunk/dependencies/ivy-jenkins.jar>

BUILD FAILED
<https://builds.apache.org/job/IvyDE-updatesite/ws/trunk/build.xml>:461: Can't get http://builds.apache.org//job/Ivy/lastSuccessfulBuild/artifact/trunk/build/artifact/jars/ivy.jar
to <https://builds.apache.org/job/IvyDE-updatesite/ws/trunk/dependencies/ivy-jenkins.jar>

Total time: 2 seconds
Build step 'Invoke Ant' marked build as failure
[locks-and-latches] Releasing all the locks
[locks-and-latches] All the locks released
Archiving artifacts

Mime
View raw message