ant-notifications mailing list archives

Site index · List index
Message view « Date » · « Thread »
Top « Date » · « Thread »
From Apache Jenkins Server <jenk...@builds.apache.org>
Subject Build failed in Jenkins: AntLib-props #11
Date Wed, 04 Jun 2014 08:00:54 GMT
See <https://builds.apache.org/job/AntLib-props/11/>

------------------------------------------
Started by user jhm
Building remotely on ubuntu6 (Ubuntu ubuntu) in workspace <https://builds.apache.org/job/AntLib-props/ws/>
Cloning the remote Git repository
Cloning repository https://git-wip-us.apache.org/repos/asf/ant-antlibs-props.git
 > git init <https://builds.apache.org/job/AntLib-props/ws/>
Fetching upstream changes from https://git-wip-us.apache.org/repos/asf/ant-antlibs-props.git
 > git --version
 > git fetch --tags --progress https://git-wip-us.apache.org/repos/asf/ant-antlibs-props.git
+refs/heads/*:refs/remotes/origin/*
 > git config remote.origin.url https://git-wip-us.apache.org/repos/asf/ant-antlibs-props.git
 > git config remote.origin.fetch +refs/heads/*:refs/remotes/origin/*
 > git config remote.origin.url https://git-wip-us.apache.org/repos/asf/ant-antlibs-props.git
Fetching upstream changes from https://git-wip-us.apache.org/repos/asf/ant-antlibs-props.git
 > git fetch --tags --progress https://git-wip-us.apache.org/repos/asf/ant-antlibs-props.git
+refs/heads/*:refs/remotes/origin/*
 > git rev-parse origin/master^{commit}
Checking out Revision ec4d78e5842047a4a290d01519af5cd21eef5b70 (origin/master)
 > git config core.sparsecheckout
 > git checkout -f ec4d78e5842047a4a290d01519af5cd21eef5b70
 > git rev-list ec4d78e5842047a4a290d01519af5cd21eef5b70
Adding Clover Publisher with reportDir: clover
[AntLib-props] $ ant clover.fullclean -file prepare.xml bootstrap -Dclover.skip.json=true
-Dclover.skip.current=true -listener com.atlassian.clover.ci.AntIntegrationListener -lib "<https://builds.apache.org/job/AntLib-props/ws/.clover/clover.jar">
-Dclover.license.path="<https://builds.apache.org/job/AntLib-props/ws/.clover/clover.license">
Buildfile: <https://builds.apache.org/job/AntLib-props/ws/prepare.xml>
[clover-env] Loading clover.xml: jar:<https://builds.apache.org/job/AntLib-props/ws/.clover/clover.jar!/clover.xml>

clover.clean:
[clover-clean] Clover Version 3.3.0, built on March 31 2014 (build-912)
[clover-clean] Loaded from: <https://builds.apache.org/job/AntLib-props/ws/.clover/clover.jar>

BUILD FAILED
jar:<https://builds.apache.org/job/AntLib-props/ws/.clover/clover.jar!/clover.xml>:105:
clover.com.atlassian.extras.decoder.api.LicenseDecoderNotFoundException: Could not find any
valid decoders in [clover.com.atlassian.extras.decoder.v2.Version2LicenseDecoder@78e61fd1,
clover.com.atlassian.extras.decoder.v1.Version1LicenseDecoder@4c331059] for license string
<>
	at clover.com.atlassian.extras.decoder.api.DelegatingLicenseDecoder.decode(DelegatingLicenseDecoder.java:47)
	at clover.com.atlassian.extras.core.DefaultLicenseManager.decodeLicense(DefaultLicenseManager.java:63)
	at clover.com.atlassian.extras.core.DefaultLicenseManager.getLicense(DefaultLicenseManager.java:48)
	at com.atlassian.clover.CloverLicense.<init>(CloverLicense.java:96)
	at com.atlassian.clover.CloverStartup$LicenseFileLoader.loadLicense(CloverStartup.java:263)
	at com.atlassian.clover.CloverStartup.loadLicense(CloverStartup.java:51)
	at com.atlassian.clover.CloverStartup.loadLicense(CloverStartup.java:26)
	at com.atlassian.clover.ant.tasks.AbstractCloverTask.execute(AbstractCloverTask.java:52)
	at org.apache.tools.ant.UnknownElement.execute(UnknownElement.java:291)
	at sun.reflect.GeneratedMethodAccessor4.invoke(Unknown Source)
	at sun.reflect.DelegatingMethodAccessorImpl.invoke(DelegatingMethodAccessorImpl.java:43)
	at java.lang.reflect.Method.invoke(Method.java:622)
	at org.apache.tools.ant.dispatch.DispatchUtils.execute(DispatchUtils.java:106)
	at org.apache.tools.ant.Task.perform(Task.java:348)
	at org.apache.tools.ant.Target.execute(Target.java:390)
	at org.apache.tools.ant.Target.performTasks(Target.java:411)
	at org.apache.tools.ant.Project.executeSortedTargets(Project.java:1399)
	at org.apache.tools.ant.Project.executeTarget(Project.java:1368)
	at org.apache.tools.ant.helper.DefaultExecutor.executeTargets(DefaultExecutor.java:41)
	at org.apache.tools.ant.Project.executeTargets(Project.java:1251)
	at org.apache.tools.ant.Main.runBuild(Main.java:809)
	at org.apache.tools.ant.Main.startAnt(Main.java:217)
	at org.apache.tools.ant.launch.Launcher.run(Launcher.java:280)
	at org.apache.tools.ant.launch.Launcher.main(Launcher.java:109)

Total time: 2 seconds
[clover] No Clover reports written.  No Clover instrumentation was done. No tests were run.
Build step 'Invoke Ant' marked build as failure
[WARNINGS] Skipping publisher since build result is FAILURE
[TASKS] Skipping publisher since build result is FAILURE
Archiving artifacts
Recording test results
Publishing Javadoc

Mime
View raw message