ant-notifications mailing list archives

Site index · List index
Message view « Date » · « Thread »
Top « Date » · « Thread »
From Apache Jenkins Server <jenk...@builds.apache.org>
Subject Build failed in Jenkins: IvyDE-updatesite #710
Date Mon, 10 Mar 2014 03:13:36 GMT
See <https://builds.apache.org/job/IvyDE-updatesite/710/>

------------------------------------------
Started by upstream project "Ivy" build number 467
originally caused by:
 Started by an SCM change
Building remotely on ubuntu2 in workspace <https://builds.apache.org/job/IvyDE-updatesite/ws/>
java.io.IOException: Failed to mkdirs: <https://builds.apache.org/job/IvyDE-updatesite/ws/>
	at hudson.FilePath.mkdirs(FilePath.java:1069)
	at hudson.model.AbstractProject.checkout(AbstractProject.java:1404)
	at hudson.model.AbstractBuild$AbstractBuildExecution.defaultCheckout(AbstractBuild.java:651)
	at jenkins.scm.SCMCheckoutStrategy.checkout(SCMCheckoutStrategy.java:88)
	at hudson.model.AbstractBuild$AbstractBuildExecution.run(AbstractBuild.java:560)
	at hudson.model.Run.execute(Run.java:1670)
	at hudson.model.FreeStyleBuild.run(FreeStyleBuild.java:46)
	at hudson.model.ResourceController.execute(ResourceController.java:88)
	at hudson.model.Executor.run(Executor.java:231)
Retrying after 10 seconds
java.io.IOException: Failed to mkdirs: <https://builds.apache.org/job/IvyDE-updatesite/ws/>
	at hudson.FilePath.mkdirs(FilePath.java:1069)
	at hudson.model.AbstractProject.checkout(AbstractProject.java:1404)
	at hudson.model.AbstractBuild$AbstractBuildExecution.defaultCheckout(AbstractBuild.java:651)
	at jenkins.scm.SCMCheckoutStrategy.checkout(SCMCheckoutStrategy.java:88)
	at hudson.model.AbstractBuild$AbstractBuildExecution.run(AbstractBuild.java:560)
	at hudson.model.Run.execute(Run.java:1670)
	at hudson.model.FreeStyleBuild.run(FreeStyleBuild.java:46)
	at hudson.model.ResourceController.execute(ResourceController.java:88)
	at hudson.model.Executor.run(Executor.java:231)
Retrying after 10 seconds
java.io.IOException: Failed to mkdirs: <https://builds.apache.org/job/IvyDE-updatesite/ws/>
	at hudson.FilePath.mkdirs(FilePath.java:1069)
	at hudson.model.AbstractProject.checkout(AbstractProject.java:1404)
	at hudson.model.AbstractBuild$AbstractBuildExecution.defaultCheckout(AbstractBuild.java:651)
	at jenkins.scm.SCMCheckoutStrategy.checkout(SCMCheckoutStrategy.java:88)
	at hudson.model.AbstractBuild$AbstractBuildExecution.run(AbstractBuild.java:560)
	at hudson.model.Run.execute(Run.java:1670)
	at hudson.model.FreeStyleBuild.run(FreeStyleBuild.java:46)
	at hudson.model.ResourceController.execute(ResourceController.java:88)
	at hudson.model.Executor.run(Executor.java:231)
Archiving artifacts
ERROR: Publisher hudson.tasks.ArtifactArchiver aborted due to exception
<https://builds.apache.org/job/IvyDE-updatesite/ws/> does not exist.
	at org.apache.tools.ant.types.AbstractFileSet.getDirectoryScanner(AbstractFileSet.java:483)
	at org.apache.tools.ant.types.AbstractFileSet.getDirectoryScanner(AbstractFileSet.java:460)
	at hudson.tasks.ArtifactArchiver$ListFiles.invoke(ArtifactArchiver.java:181)
	at hudson.tasks.ArtifactArchiver$ListFiles.invoke(ArtifactArchiver.java:172)
	at hudson.FilePath$FileCallableWrapper.call(FilePath.java:2461)
	at hudson.remoting.UserRequest.perform(UserRequest.java:118)
	at hudson.remoting.UserRequest.perform(UserRequest.java:48)
	at hudson.remoting.Request$2.run(Request.java:328)
	at hudson.remoting.InterceptingExecutorService$1.call(InterceptingExecutorService.java:72)
	at java.util.concurrent.FutureTask.run(FutureTask.java:262)
	at java.util.concurrent.ThreadPoolExecutor.runWorker(ThreadPoolExecutor.java:1145)
	at java.util.concurrent.ThreadPoolExecutor$Worker.run(ThreadPoolExecutor.java:615)
	at java.lang.Thread.run(Thread.java:744)

Mime
View raw message