ant-notifications mailing list archives

Site index · List index
Message view « Date » · « Thread »
Top « Date » · « Thread »
From Apache Jenkins Server <jenk...@builds.apache.org>
Subject Build failed in Jenkins: Ant-Build-Matrix » JDK 1.5 (latest),Windows #555
Date Wed, 06 Mar 2013 04:11:12 GMT
See <https://builds.apache.org/job/Ant-Build-Matrix/./jdk=JDK%201.5%20(latest),label=Windows/555/changes>

Changes:

[Jesse Glick] StringUtils.replace is obsolete.

[Jesse Glick] Diagnosis of XMLResultAggregatorTest.testFrames failure on Java 7.

[Jesse Glick] Restored Java 5 compilability.

[Jesse Glick] Was not compatible to make systemClasspath (and systemBootClasspath) final;
the NetBeans Ant integration in fact overwrites this value (for a reason).

------------------------------------------
[...truncated 54 lines...]
     [exec] Note: Some input files use or override a deprecated API.
     [exec] Note: Recompile with -Xlint:deprecation for details.
     [exec] Note: Some input files use unchecked or unsafe operations.
     [exec] Note: Recompile with -Xlint:unchecked for details.
     [exec] Copying 5 files to <https://builds.apache.org/job/Ant-Build-Matrix/./jdk=JDK%201.5%20(latest),label=Windows/ws/trunk\build\classes>
     [exec] Copying 2 files to <https://builds.apache.org/job/Ant-Build-Matrix/./jdk=JDK%201.5%20(latest),label=Windows/ws/trunk\build\classes>
     [exec] Copying 2 files to <https://builds.apache.org/job/Ant-Build-Matrix/./jdk=JDK%201.5%20(latest),label=Windows/ws/trunk\build\classes\org\apache\tools\ant\taskdefs\optional\junit\xsl>
     [exec] 
     [exec] jars:
     [exec] Copying 2 files to <https://builds.apache.org/job/Ant-Build-Matrix/./jdk=JDK%201.5%20(latest),label=Windows/ws/trunk\build>
     [exec] Copying 1 file to <https://builds.apache.org/job/Ant-Build-Matrix/./jdk=JDK%201.5%20(latest),label=Windows/ws/trunk\build>
     [exec] Building jar: <https://builds.apache.org/job/Ant-Build-Matrix/./jdk=JDK%201.5%20(latest),label=Windows/ws/trunk\build\lib\ant-launcher.jar>
     [exec] Building jar: <https://builds.apache.org/job/Ant-Build-Matrix/./jdk=JDK%201.5%20(latest),label=Windows/ws/trunk\build\lib\ant.jar>
     [exec] Building jar: <https://builds.apache.org/job/Ant-Build-Matrix/./jdk=JDK%201.5%20(latest),label=Windows/ws/trunk\build\lib\ant-bootstrap.jar>
     [exec] Building jar: <https://builds.apache.org/job/Ant-Build-Matrix/./jdk=JDK%201.5%20(latest),label=Windows/ws/trunk\build\lib\ant-apache-resolver.jar>
     [exec] Building jar: <https://builds.apache.org/job/Ant-Build-Matrix/./jdk=JDK%201.5%20(latest),label=Windows/ws/trunk\build\lib\ant-junit.jar>
     [exec] Building jar: <https://builds.apache.org/job/Ant-Build-Matrix/./jdk=JDK%201.5%20(latest),label=Windows/ws/trunk\build\lib\ant-junit4.jar>
     [exec] Building jar: <https://builds.apache.org/job/Ant-Build-Matrix/./jdk=JDK%201.5%20(latest),label=Windows/ws/trunk\build\lib\ant-apache-regexp.jar>
     [exec] Building jar: <https://builds.apache.org/job/Ant-Build-Matrix/./jdk=JDK%201.5%20(latest),label=Windows/ws/trunk\build\lib\ant-apache-oro.jar>
     [exec] Building jar: <https://builds.apache.org/job/Ant-Build-Matrix/./jdk=JDK%201.5%20(latest),label=Windows/ws/trunk\build\lib\ant-apache-bcel.jar>
     [exec] Building jar: <https://builds.apache.org/job/Ant-Build-Matrix/./jdk=JDK%201.5%20(latest),label=Windows/ws/trunk\build\lib\ant-apache-log4j.jar>
     [exec] Building jar: <https://builds.apache.org/job/Ant-Build-Matrix/./jdk=JDK%201.5%20(latest),label=Windows/ws/trunk\build\lib\ant-commons-logging.jar>
     [exec] Building jar: <https://builds.apache.org/job/Ant-Build-Matrix/./jdk=JDK%201.5%20(latest),label=Windows/ws/trunk\build\lib\ant-apache-bsf.jar>
     [exec] Building jar: <https://builds.apache.org/job/Ant-Build-Matrix/./jdk=JDK%201.5%20(latest),label=Windows/ws/trunk\build\lib\ant-javamail.jar>
     [exec] Building jar: <https://builds.apache.org/job/Ant-Build-Matrix/./jdk=JDK%201.5%20(latest),label=Windows/ws/trunk\build\lib\ant-netrexx.jar>
     [exec] Building jar: <https://builds.apache.org/job/Ant-Build-Matrix/./jdk=JDK%201.5%20(latest),label=Windows/ws/trunk\build\lib\ant-commons-net.jar>
     [exec] Building jar: <https://builds.apache.org/job/Ant-Build-Matrix/./jdk=JDK%201.5%20(latest),label=Windows/ws/trunk\build\lib\ant-antlr.jar>
     [exec] Building jar: <https://builds.apache.org/job/Ant-Build-Matrix/./jdk=JDK%201.5%20(latest),label=Windows/ws/trunk\build\lib\ant-jmf.jar>
     [exec] Building jar: <https://builds.apache.org/job/Ant-Build-Matrix/./jdk=JDK%201.5%20(latest),label=Windows/ws/trunk\build\lib\ant-jai.jar>
     [exec] Building jar: <https://builds.apache.org/job/Ant-Build-Matrix/./jdk=JDK%201.5%20(latest),label=Windows/ws/trunk\build\lib\ant-swing.jar>
     [exec] Building jar: <https://builds.apache.org/job/Ant-Build-Matrix/./jdk=JDK%201.5%20(latest),label=Windows/ws/trunk\build\lib\ant-jsch.jar>
     [exec] Building jar: <https://builds.apache.org/job/Ant-Build-Matrix/./jdk=JDK%201.5%20(latest),label=Windows/ws/trunk\build\lib\ant-jdepend.jar>
     [exec] Building jar: <https://builds.apache.org/job/Ant-Build-Matrix/./jdk=JDK%201.5%20(latest),label=Windows/ws/trunk\build\lib\ant-apache-xalan2.jar>
     [exec] 
     [exec] compile-tests:
     [exec] Created dir: <https://builds.apache.org/job/Ant-Build-Matrix/./jdk=JDK%201.5%20(latest),label=Windows/ws/trunk\build\testcases>
     [exec] Compiling 295 source files to <https://builds.apache.org/job/Ant-Build-Matrix/./jdk=JDK%201.5%20(latest),label=Windows/ws/trunk\build\testcases>
     [exec] Note: Some input files use or override a deprecated API.
     [exec] Note: Recompile with -Xlint:deprecation for details.
     [exec] Note: Some input files use unchecked or unsafe operations.
     [exec] Note: Recompile with -Xlint:unchecked for details.
     [exec] Building jar: <https://builds.apache.org/job/Ant-Build-Matrix/./jdk=JDK%201.5%20(latest),label=Windows/ws/trunk\build\testcases\org\apache\tools\ant\taskdefs\test2-antlib.jar>
     [exec] 
     [exec] test-jar:
     [exec] Building jar: <https://builds.apache.org/job/Ant-Build-Matrix/./jdk=JDK%201.5%20(latest),label=Windows/ws/trunk\build\lib\ant-testutil.jar>
     [exec] 
     [exec] dist-lite:
     [exec] Created dir: <https://builds.apache.org/job/Ant-Build-Matrix/./jdk=JDK%201.5%20(latest),label=Windows/ws/trunk\bootstrap>
     [exec] Created dir: <https://builds.apache.org/job/Ant-Build-Matrix/./jdk=JDK%201.5%20(latest),label=Windows/ws/trunk\bootstrap\bin>
     [exec] Created dir: <https://builds.apache.org/job/Ant-Build-Matrix/./jdk=JDK%201.5%20(latest),label=Windows/ws/trunk\bootstrap\lib>
     [exec] Copying 22 files to <https://builds.apache.org/job/Ant-Build-Matrix/./jdk=JDK%201.5%20(latest),label=Windows/ws/trunk\bootstrap\lib>
     [exec] Copying 13 files to <https://builds.apache.org/job/Ant-Build-Matrix/./jdk=JDK%201.5%20(latest),label=Windows/ws/trunk\bootstrap\bin>
     [exec] 
     [exec] BUILD SUCCESSFUL
     [exec] Total time: 27 seconds
     [exec] 
     [exec] ... Cleaning Up Build Directories
     [exec] 
     [exec] ... Done Bootstrapping Ant Distribution
     [exec] Buildfile: <https://builds.apache.org/job/Ant-Build-Matrix/./jdk=JDK%201.5%20(latest),label=Windows/ws/trunk\build.xml>
     [exec] 
     [exec] clean:
     [exec]    [delete] Deleting directory <https://builds.apache.org/job/Ant-Build-Matrix/./jdk=JDK%201.5%20(latest),label=Windows/ws/trunk\build>
     [exec] 
     [exec] allclean:
     [exec]    [delete] Deleting: <https://builds.apache.org/job/Ant-Build-Matrix/./jdk=JDK%201.5%20(latest),label=Windows/ws/trunk\bootstrap\bin\antRun>
     [exec]    [delete] Deleting: <https://builds.apache.org/job/Ant-Build-Matrix/./jdk=JDK%201.5%20(latest),label=Windows/ws/trunk\bootstrap\bin\antRun.bat>
     [exec] 
     [exec] check_for_optional_packages:
     [exec] 
     [exec] xml-check:
     [exec] 
     [exec] dump-sys-properties:
     [exec]      [echo] java.vm.info=mixed mode
     [exec]      [echo] java.vm.name=Java HotSpot(TM) 64-Bit Server VM
     [exec]      [echo] java.vm.vendor=Sun Microsystems Inc.
     [exec]      [echo] java.vm.version=1.5.0_22-b03
     [exec]      [echo] os.arch=amd64
     [exec]      [echo] os.name=Windows Server 2008
     [exec]      [echo] os.version=6.0
     [exec]      [echo] file.encoding=Cp1252
     [exec]      [echo] user.language=en
     [exec]      [echo] ant.version=Apache Ant(TM) version 1.9.0 compiled on March 6 2013
     [exec] 
     [exec] run-which:
     [exec] 
     [exec] dump-info:
     [exec] 
     [exec] prepare:
     [exec] 
     [exec] build:
     [exec]     [mkdir] Created dir: <https://builds.apache.org/job/Ant-Build-Matrix/./jdk=JDK%201.5%20(latest),label=Windows/ws/trunk\build>
     [exec]     [mkdir] Created dir: <https://builds.apache.org/job/Ant-Build-Matrix/./jdk=JDK%201.5%20(latest),label=Windows/ws/trunk\build\classes>
     [exec]     [mkdir] Created dir: <https://builds.apache.org/job/Ant-Build-Matrix/./jdk=JDK%201.5%20(latest),label=Windows/ws/trunk\build\lib>
     [exec]     [javac] Compiling 798 source files to <https://builds.apache.org/job/Ant-Build-Matrix/./jdk=JDK%201.5%20(latest),label=Windows/ws/trunk\build\classes>
     [exec]     [javac] Note: Some input files use or override a deprecated API.
     [exec]     [javac] Note: Recompile with -Xlint:deprecation for details.
     [exec]     [javac] Note: Some input files use unchecked or unsafe operations.
     [exec]     [javac] Note: Recompile with -Xlint:unchecked for details.
     [exec]      [copy] Copying 7 files to <https://builds.apache.org/job/Ant-Build-Matrix/./jdk=JDK%201.5%20(latest),label=Windows/ws/trunk\build\classes>
     [exec]      [copy] Copying 2 files to <https://builds.apache.org/job/Ant-Build-Matrix/./jdk=JDK%201.5%20(latest),label=Windows/ws/trunk\build\classes>
     [exec]      [copy] Copying 2 files to <https://builds.apache.org/job/Ant-Build-Matrix/./jdk=JDK%201.5%20(latest),label=Windows/ws/trunk\build\classes\org\apache\tools\ant\taskdefs\optional\junit\xsl>
     [exec] 
     [exec] compile-tests:
     [exec]     [mkdir] Created dir: <https://builds.apache.org/job/Ant-Build-Matrix/./jdk=JDK%201.5%20(latest),label=Windows/ws/trunk\build\testcases>
     [exec]     [javac] Compiling 295 source files to <https://builds.apache.org/job/Ant-Build-Matrix/./jdk=JDK%201.5%20(latest),label=Windows/ws/trunk\build\testcases>
     [exec]     [javac] Note: Some input files use or override a deprecated API.
     [exec]     [javac] Note: Recompile with -Xlint:deprecation for details.
     [exec]     [javac] Note: Some input files use unchecked or unsafe operations.
     [exec]     [javac] Note: Recompile with -Xlint:unchecked for details.
     [exec]       [jar] Building jar: <https://builds.apache.org/job/Ant-Build-Matrix/./jdk=JDK%201.5%20(latest),label=Windows/ws/trunk\build\testcases\org\apache\tools\ant\taskdefs\test2-antlib.jar>
     [exec] 
     [exec] probe-offline:
     [exec] 
     [exec] test-init:
     [exec] 
     [exec] junit-batch:
     [exec]     [mkdir] Created dir: <https://builds.apache.org/job/Ant-Build-Matrix/./jdk=JDK%201.5%20(latest),label=Windows/ws/trunk\build\failingTests>
     [exec]     [mkdir] Created dir: <https://builds.apache.org/job/Ant-Build-Matrix/./jdk=JDK%201.5%20(latest),label=Windows/ws/trunk\build\testcases\xml>
     [exec]     [junit] WARNING: multiple versions of ant detected in path for junit 
     [exec]     [junit]          jar:file:/F:/hudson/hudson-slave/workspace/Ant-Build-Matrix/jdk/JDK%201.5%20(latest)/label/Windows/trunk/bootstrap/lib/ant.jar!/org/apache/tools/ant/Project.class
     [exec]     [junit]      and <https://builds.apache.org/job/Ant-Build-Matrix/./jdk=JDK%201.5%20(latest),label=Windows/ws/trunk/build/classes/org/apache/tools/ant/Project.class>
     [exec]     [junit] Error occurred during initialization of VM
     [exec]     [junit] Could not reserve enough space for object heap
     [exec]     [junit] Testsuite: org.apache.tools.zip.Batch-With-Multiple-Tests
     [exec]     [junit] Tests run: 1, Failures: 0, Errors: 1, Skipped: 0, Time elapsed: 0
sec
     [exec]     [junit] 
     [exec]     [junit] Testcase: org.apache.tools.zip.Batch-With-Multiple-Tests:null:	Caused
an ERROR
     [exec]     [junit] Forked Java VM exited abnormally. Please note the time in the report
does not reflect the time until the VM exit.
     [exec]     [junit] junit.framework.AssertionFailedError: Forked Java VM exited abnormally.
Please note the time in the report does not reflect the time until the VM exit.
     [exec]     [junit] 
     [exec]     [junit] 
     [exec] 
     [exec] junit-single-test-only:
     [exec] 
     [exec] junit-single-test:
     [exec] 
     [exec] junit-tests:
     [exec] 
     [exec] junit-report-only:
     [exec]     [mkdir] Created dir: <https://builds.apache.org/job/Ant-Build-Matrix/./jdk=JDK%201.5%20(latest),label=Windows/ws/trunk\build\testcases\reports>
     [exec]     [junit] Tests FAILED (crashed)
     [exec] [junitreport] Processing <https://builds.apache.org/job/Ant-Build-Matrix/./jdk=JDK%201.5%20(latest),label=Windows/ws/trunk\build\testcases\reports\TESTS-TestSuites.xml>
to C:\Users\hudson\AppData\Local\Temp\null730224290
     [exec] [junitreport] Loading stylesheet jar:file:/F:/hudson/hudson-slave/workspace/Ant-Build-Matrix/jdk/JDK%201.5%20(latest)/label/Windows/trunk/bootstrap/lib/ant-junit.jar!/org/apache/tools/ant/taskdefs/optional/junit/xsl/junit-frames.xsl
     [exec] [junitreport] Transform time: 803ms
     [exec] [junitreport] Deleting: C:\Users\hudson\AppData\Local\Temp\null730224290
     [exec] 
     [exec] junit-report:
     [exec] 
     [exec] -antunit-check-location:
     [exec] 
     [exec] -antunit-warn-location:
     [exec]      [echo] AntUnit tests must be run with <https://builds.apache.org/job/Ant-Build-Matrix/./jdk=JDK%201.5%20(latest),label=Windows/ws/trunk\bootstrap>
(or <https://builds.apache.org/job/Ant-Build-Matrix/./jdk=JDK%201.5%20(latest),label=Windows/ws/trunk\dist),>
not <https://builds.apache.org/job/Ant-Build-Matrix/./jdk=JDK%201.5%20(latest),label=Windows/ws/trunk\\bootstrap.>
Try './build.sh antunit-tests' for example.
     [exec] 
     [exec] antunit-tests:
     [exec]     [mkdir] Created dir: <https://builds.apache.org/job/Ant-Build-Matrix/./jdk=JDK%201.5%20(latest),label=Windows/ws/trunk\build\antunit\xml>
     [exec] [au:antunit] Build File: <https://builds.apache.org/job/Ant-Build-Matrix/./jdk=JDK%201.5%20(latest),label=Windows/ws/trunk\src\tests\antunit\bugfixes\br50866\br50866-test.xml>
     [exec] [au:antunit] Tests run: 1, Failures: 0, Errors: 0, Time elapsed: 0.052 sec
     [exec] [au:antunit] Target: testinclude took 0.02 sec
     [exec] [au:antunit] Build File: <https://builds.apache.org/job/Ant-Build-Matrix/./jdk=JDK%201.5%20(latest),label=Windows/ws/trunk\src\tests\antunit\bugfixes\bugzilla-43324-stackoverflow-test.xml>
     [exec] [au:antunit] Tests run: 1, Failures: 0, Errors: 0, Time elapsed: 0.013 sec
     [exec] [au:antunit] Target: testnested took 0.004 sec
     [exec] [au:antunit] Build File: <https://builds.apache.org/job/Ant-Build-Matrix/./jdk=JDK%201.5%20(latest),label=Windows/ws/trunk\src\tests\antunit\core\bindtargets-test.xml>
     [exec] [au:antunit] Tests run: 1, Failures: 0, Errors: 0, Time elapsed: 0.028 sec
     [exec] [au:antunit] Target: testBind took 0.004 sec
     [exec] [au:antunit] Build File: <https://builds.apache.org/job/Ant-Build-Matrix/./jdk=JDK%201.5%20(latest),label=Windows/ws/trunk\src\tests\antunit\core\classloader-test.xml>
     [exec] [au:antunit] Tests run: 3, Failures: 0, Errors: 0, Time elapsed: 1.556 sec
     [exec] [au:antunit] Target: testGetResource took 1.302 sec
     [exec] [au:antunit] Target: testLoadClass took 0.122 sec
     [exec] [au:antunit] Target: testGetResourceAsStream took 0.096 sec
     [exec] [au:antunit] Build File: <https://builds.apache.org/job/Ant-Build-Matrix/./jdk=JDK%201.5%20(latest),label=Windows/ws/trunk\src\tests\antunit\core\createtask-test.xml>
     [exec] [au:antunit] Tests run: 1, Failures: 0, Errors: 0, Time elapsed: 0.273 sec
     [exec] [au:antunit] Target: testCreateTaskInFreshProject took 0.258 sec
     [exec] [au:antunit] Build File: <https://builds.apache.org/job/Ant-Build-Matrix/./jdk=JDK%201.5%20(latest),label=Windows/ws/trunk\src\tests\antunit\core\dirscanner-symlinks-test.xml>
     [exec] [au:antunit] Tests run: 13, Failures: 0, Errors: 0, Time elapsed: 0.206 sec
     [exec] [au:antunit] Target: testRepeatedName took 0.018 sec
     [exec] [au:antunit] Target: testBasedirIsSymlinkFollow took 0.002 sec
     [exec] [au:antunit] Target: testLinkToParentFollowMax2 took 0.001 sec
     [exec] [au:antunit] Target: testLinkToParentFollow took 0.001 sec
     [exec] [au:antunit] Target: testLinkToParentFollowWithInclude took 0.002 sec
     [exec] [au:antunit] Target: testLinkToParentFollowWithIncludeMultiFollow took 0.001 sec

BUILD SUCCESSFUL
Total time: 1 minute 41 seconds
Recording test results
ERROR: Failed to archive test reports
hudson.util.IOException2: remote file operation failed: <https://builds.apache.org/job/Ant-Build-Matrix/./jdk=JDK%201.5%20(latest),label=Windows/ws/>
at hudson.remoting.Channel@7bb37db5:windows1
	at hudson.FilePath.act(FilePath.java:861)
	at hudson.FilePath.act(FilePath.java:838)
	at hudson.tasks.junit.JUnitParser.parse(JUnitParser.java:87)
	at hudson.tasks.junit.JUnitResultArchiver.parse(JUnitResultArchiver.java:122)
	at hudson.tasks.junit.JUnitResultArchiver.perform(JUnitResultArchiver.java:134)
	at hudson.tasks.BuildStepMonitor$1.perform(BuildStepMonitor.java:19)
	at hudson.model.AbstractBuild$AbstractBuildExecution.perform(AbstractBuild.java:810)
	at hudson.model.AbstractBuild$AbstractBuildExecution.performAllBuildSteps(AbstractBuild.java:785)
	at hudson.model.Build$BuildExecution.post2(Build.java:183)
	at hudson.model.AbstractBuild$AbstractBuildExecution.post(AbstractBuild.java:732)
	at hudson.model.Run.execute(Run.java:1593)
	at hudson.matrix.MatrixRun.run(MatrixRun.java:146)
	at hudson.model.ResourceController.execute(ResourceController.java:88)
	at hudson.model.Executor.run(Executor.java:236)
Caused by: hudson.util.IOException2: Failed to read <https://builds.apache.org/job/Ant-Build-Matrix/./jdk=JDK%201.5%20(latest),label=Windows/ws/trunk\build\antunit\xml\TEST-src.tests.antunit.core.dirscanner-symlinks-test_xml.xml>
	at hudson.tasks.junit.TestResult.parse(TestResult.java:284)
	at hudson.tasks.junit.TestResult.parsePossiblyEmpty(TestResult.java:223)
	at hudson.tasks.junit.TestResult.parse(TestResult.java:158)
	at hudson.tasks.junit.TestResult.parse(TestResult.java:141)
	at hudson.tasks.junit.TestResult.<init>(TestResult.java:117)
	at hudson.tasks.junit.JUnitParser$ParseResultCallable.invoke(JUnitParser.java:117)
	at hudson.tasks.junit.JUnitParser$ParseResultCallable.invoke(JUnitParser.java:90)
	at hudson.FilePath$FileCallableWrapper.call(FilePath.java:2348)
	at hudson.remoting.UserRequest.perform(UserRequest.java:118)
	at hudson.remoting.UserRequest.perform(UserRequest.java:48)
	at hudson.remoting.Request$2.run(Request.java:326)
	at hudson.remoting.InterceptingExecutorService$1.call(InterceptingExecutorService.java:72)
	at java.util.concurrent.FutureTask$Sync.innerRun(Unknown Source)
	at java.util.concurrent.FutureTask.run(Unknown Source)
	at java.util.concurrent.ThreadPoolExecutor.runWorker(Unknown Source)
	at java.util.concurrent.ThreadPoolExecutor$Worker.run(Unknown Source)
	at hudson.remoting.Engine$1$1.run(Engine.java:58)
	at java.lang.Thread.run(Unknown Source)
Caused by: org.dom4j.DocumentException: Error on line 117 of document file:///f:/hudson/hudson-slave/workspace/Ant-Build-Matrix/jdk/JDK%201.5%20(latest)/label/Windows/trunk/build/antunit/xml/TEST-src.tests.antunit.core.dirscanner-symlinks-test_xml.xml
: XML document structures must start and end within the same entity. Nested exception: XML
document structures must start and end within the same entity.
	at org.dom4j.io.SAXReader.read(SAXReader.java:482)
	at org.dom4j.io.SAXReader.read(SAXReader.java:264)
	at hudson.tasks.junit.SuiteResult.parse(SuiteResult.java:129)
	at hudson.tasks.junit.TestResult.parse(TestResult.java:267)
	... 17 more
Caused by: org.xml.sax.SAXParseException; systemId: file:///f:/hudson/hudson-slave/workspace/Ant-Build-Matrix/jdk/JDK%201.5%20(latest)/label/Windows/trunk/build/antunit/xml/TEST-src.tests.antunit.core.dirscanner-symlinks-test_xml.xml;
lineNumber: 117; columnNumber: 1; XML document structures must start and end within the same
entity.
	at com.sun.org.apache.xerces.internal.util.ErrorHandlerWrapper.createSAXParseException(Unknown
Source)
	at com.sun.org.apache.xerces.internal.util.ErrorHandlerWrapper.fatalError(Unknown Source)
	at com.sun.org.apache.xerces.internal.impl.XMLErrorReporter.reportError(Unknown Source)
	at com.sun.org.apache.xerces.internal.impl.XMLErrorReporter.reportError(Unknown Source)
	at com.sun.org.apache.xerces.internal.impl.XMLScanner.reportFatalError(Unknown Source)
	at com.sun.org.apache.xerces.internal.impl.XMLDocumentFragmentScannerImpl.endEntity(Unknown
Source)
	at com.sun.org.apache.xerces.internal.impl.XMLDocumentScannerImpl.endEntity(Unknown Source)
	at com.sun.org.apache.xerces.internal.impl.XMLEntityManager.endEntity(Unknown Source)
	at com.sun.org.apache.xerces.internal.impl.XMLEntityScanner.load(Unknown Source)
	at com.sun.org.apache.xerces.internal.impl.XMLEntityScanner.skipChar(Unknown Source)
	at com.sun.org.apache.xerces.internal.impl.XMLDocumentFragmentScannerImpl$FragmentContentDriver.next(Unknown
Source)
	at com.sun.org.apache.xerces.internal.impl.XMLDocumentScannerImpl.next(Unknown Source)
	at com.sun.org.apache.xerces.internal.impl.XMLNSDocumentScannerImpl.next(Unknown Source)
	at com.sun.org.apache.xerces.internal.impl.XMLDocumentFragmentScannerImpl.scanDocument(Unknown
Source)
	at com.sun.org.apache.xerces.internal.parsers.XML11Configuration.parse(Unknown Source)
	at com.sun.org.apache.xerces.internal.parsers.XML11Configuration.parse(Unknown Source)
	at com.sun.org.apache.xerces.internal.parsers.XMLParser.parse(Unknown Source)
	at com.sun.org.apache.xerces.internal.parsers.AbstractSAXParser.parse(Unknown Source)
	at com.sun.org.apache.xerces.internal.jaxp.SAXParserImpl$JAXPSAXParser.parse(Unknown Source)
	at org.dom4j.io.SAXReader.read(SAXReader.java:465)
	... 20 more
Build step 'Publish JUnit test result report' changed build result to FAILURE

Mime
View raw message