ant-notifications mailing list archives

Site index · List index
Message view « Date » · « Thread »
Top « Date » · « Thread »
From Apache Jenkins Server <jenk...@builds.apache.org>
Subject Build failed in Jenkins: Ant-Build-Matrix » JDK 1.7 (latest),Windows #555
Date Wed, 06 Mar 2013 04:15:36 GMT
See <https://builds.apache.org/job/Ant-Build-Matrix/./jdk=JDK%201.7%20(latest),label=Windows/555/changes>

Changes:

[Jesse Glick] StringUtils.replace is obsolete.

[Jesse Glick] Diagnosis of XMLResultAggregatorTest.testFrames failure on Java 7.

[Jesse Glick] Restored Java 5 compilability.

[Jesse Glick] Was not compatible to make systemClasspath (and systemBootClasspath) final;
the NetBeans Ant integration in fact overwrites this value (for a reason).

------------------------------------------
[...truncated 137 lines...]
     [exec]      [echo] os.name=Windows Server 2008
     [exec]      [echo] os.version=6.0
     [exec]      [echo] file.encoding=Cp1252
     [exec]      [echo] user.language=en
     [exec]      [echo] ant.version=Apache Ant(TM) version 1.9.0 compiled on March 6 2013
     [exec] 
     [exec] run-which:
     [exec] 
     [exec] dump-info:
     [exec] 
     [exec] prepare:
     [exec] 
     [exec] build:
     [exec]     [mkdir] Created dir: <https://builds.apache.org/job/Ant-Build-Matrix/./jdk=JDK%201.7%20(latest),label=Windows/ws/trunk\build>
     [exec]     [mkdir] Created dir: <https://builds.apache.org/job/Ant-Build-Matrix/./jdk=JDK%201.7%20(latest),label=Windows/ws/trunk\build\classes>
     [exec]     [mkdir] Created dir: <https://builds.apache.org/job/Ant-Build-Matrix/./jdk=JDK%201.7%20(latest),label=Windows/ws/trunk\build\lib>
     [exec]     [javac] Compiling 798 source files to <https://builds.apache.org/job/Ant-Build-Matrix/./jdk=JDK%201.7%20(latest),label=Windows/ws/trunk\build\classes>
     [exec]     [javac] warning: [options] bootstrap class path not set in conjunction with
-source 1.5
     [exec]     [javac] Note: Some input files use or override a deprecated API.
     [exec]     [javac] Note: Recompile with -Xlint:deprecation for details.
     [exec]     [javac] Note: Some input files use unchecked or unsafe operations.
     [exec]     [javac] Note: Recompile with -Xlint:unchecked for details.
     [exec]     [javac] 1 warning
     [exec]      [copy] Copying 7 files to <https://builds.apache.org/job/Ant-Build-Matrix/./jdk=JDK%201.7%20(latest),label=Windows/ws/trunk\build\classes>
     [exec]      [copy] Copying 2 files to <https://builds.apache.org/job/Ant-Build-Matrix/./jdk=JDK%201.7%20(latest),label=Windows/ws/trunk\build\classes>
     [exec]      [copy] Copying 2 files to <https://builds.apache.org/job/Ant-Build-Matrix/./jdk=JDK%201.7%20(latest),label=Windows/ws/trunk\build\classes\org\apache\tools\ant\taskdefs\optional\junit\xsl>
     [exec] 
     [exec] compile-tests:
     [exec]     [mkdir] Created dir: <https://builds.apache.org/job/Ant-Build-Matrix/./jdk=JDK%201.7%20(latest),label=Windows/ws/trunk\build\testcases>
     [exec]     [javac] Compiling 295 source files to <https://builds.apache.org/job/Ant-Build-Matrix/./jdk=JDK%201.7%20(latest),label=Windows/ws/trunk\build\testcases>
     [exec]     [javac] warning: [options] bootstrap class path not set in conjunction with
-source 1.5
     [exec]     [javac] Note: Some input files use or override a deprecated API.
     [exec]     [javac] Note: Recompile with -Xlint:deprecation for details.
     [exec]     [javac] Note: Some input files use unchecked or unsafe operations.
     [exec]     [javac] Note: Recompile with -Xlint:unchecked for details.
     [exec]     [javac] 1 warning
     [exec]       [jar] Building jar: <https://builds.apache.org/job/Ant-Build-Matrix/./jdk=JDK%201.7%20(latest),label=Windows/ws/trunk\build\testcases\org\apache\tools\ant\taskdefs\test2-antlib.jar>
     [exec] 
     [exec] probe-offline:
     [exec] 
     [exec] test-init:
     [exec] 
     [exec] junit-batch:
     [exec]     [mkdir] Created dir: <https://builds.apache.org/job/Ant-Build-Matrix/./jdk=JDK%201.7%20(latest),label=Windows/ws/trunk\build\failingTests>
     [exec]     [mkdir] Created dir: <https://builds.apache.org/job/Ant-Build-Matrix/./jdk=JDK%201.7%20(latest),label=Windows/ws/trunk\build\testcases\xml>
     [exec]     [junit] WARNING: multiple versions of ant detected in path for junit 
     [exec]     [junit]          jar:file:/F:/hudson/hudson-slave/workspace/Ant-Build-Matrix/jdk/JDK%201.7%20(latest)/label/Windows/trunk/bootstrap/lib/ant.jar!/org/apache/tools/ant/Project.class
     [exec]     [junit]      and <https://builds.apache.org/job/Ant-Build-Matrix/./jdk=JDK%201.7%20(latest),label=Windows/ws/trunk/build/classes/org/apache/tools/ant/Project.class>
     [exec]     [junit] Error occurred during initialization of VM
     [exec]     [junit] Could not reserve enough space for object heap
     [exec]     [junit] Tests FAILED (crashed)
     [exec]     [junit] Testsuite: org.apache.tools.zip.Batch-With-Multiple-Tests
     [exec]     [junit] Tests run: 1, Failures: 0, Errors: 1, Skipped: 0, Time elapsed: 0
sec
     [exec]     [junit] 
     [exec]     [junit] Testcase: org.apache.tools.zip.Batch-With-Multiple-Tests:null:	Caused
an ERROR
     [exec]     [junit] Forked Java VM exited abnormally. Please note the time in the report
does not reflect the time until the VM exit.
     [exec]     [junit] junit.framework.AssertionFailedError: Forked Java VM exited abnormally.
Please note the time in the report does not reflect the time until the VM exit.
     [exec]     [junit] 
     [exec]     [junit] 
     [exec] 
     [exec] junit-single-test-only:
     [exec] 
     [exec] junit-single-test:
     [exec] 
     [exec] junit-tests:
     [exec] 
     [exec] junit-report-only:
     [exec]     [mkdir] Created dir: <https://builds.apache.org/job/Ant-Build-Matrix/./jdk=JDK%201.7%20(latest),label=Windows/ws/trunk\build\testcases\reports>
     [exec] [junitreport] Processing <https://builds.apache.org/job/Ant-Build-Matrix/./jdk=JDK%201.7%20(latest),label=Windows/ws/trunk\build\testcases\reports\TESTS-TestSuites.xml>
to C:\Users\hudson\AppData\Local\Temp\null483777296
     [exec] [junitreport] Loading stylesheet jar:file:/F:/hudson/hudson-slave/workspace/Ant-Build-Matrix/jdk/JDK%201.7%20(latest)/label/Windows/trunk/bootstrap/lib/ant-junit.jar!/org/apache/tools/ant/taskdefs/optional/junit/xsl/junit-frames.xsl
     [exec] [junitreport] Transform time: 1071ms
     [exec] [junitreport] Deleting: C:\Users\hudson\AppData\Local\Temp\null483777296
     [exec] 
     [exec] junit-report:
     [exec] 
     [exec] -antunit-check-location:
     [exec] 
     [exec] -antunit-warn-location:
     [exec]      [echo] AntUnit tests must be run with <https://builds.apache.org/job/Ant-Build-Matrix/./jdk=JDK%201.7%20(latest),label=Windows/ws/trunk\bootstrap>
(or <https://builds.apache.org/job/Ant-Build-Matrix/./jdk=JDK%201.7%20(latest),label=Windows/ws/trunk\dist),>
not <https://builds.apache.org/job/Ant-Build-Matrix/./jdk=JDK%201.7%20(latest),label=Windows/ws/trunk\\bootstrap.>
Try './build.sh antunit-tests' for example.
     [exec] 
     [exec] antunit-tests:
     [exec]     [mkdir] Created dir: <https://builds.apache.org/job/Ant-Build-Matrix/./jdk=JDK%201.7%20(latest),label=Windows/ws/trunk\build\antunit\xml>
     [exec] [au:antunit] Build File: <https://builds.apache.org/job/Ant-Build-Matrix/./jdk=JDK%201.7%20(latest),label=Windows/ws/trunk\src\tests\antunit\bugfixes\br50866\br50866-test.xml>
     [exec] [au:antunit] Tests run: 1, Failures: 0, Errors: 0, Time elapsed: 0.017 sec
     [exec] [au:antunit] Target: testinclude took 0.004 sec
     [exec] [au:antunit] Build File: <https://builds.apache.org/job/Ant-Build-Matrix/./jdk=JDK%201.7%20(latest),label=Windows/ws/trunk\src\tests\antunit\bugfixes\bugzilla-43324-stackoverflow-test.xml>
     [exec] [au:antunit] Tests run: 1, Failures: 0, Errors: 0, Time elapsed: 0.015 sec
     [exec] [au:antunit] Target: testnested took 0.004 sec
     [exec] [au:antunit] Build File: <https://builds.apache.org/job/Ant-Build-Matrix/./jdk=JDK%201.7%20(latest),label=Windows/ws/trunk\src\tests\antunit\core\bindtargets-test.xml>
     [exec] [au:antunit] Tests run: 1, Failures: 0, Errors: 0, Time elapsed: 0.021 sec
     [exec] [au:antunit] Target: testBind took 0.004 sec
     [exec] [au:antunit] Build File: <https://builds.apache.org/job/Ant-Build-Matrix/./jdk=JDK%201.7%20(latest),label=Windows/ws/trunk\src\tests\antunit\core\classloader-test.xml>
     [exec] [au:antunit] Tests run: 3, Failures: 0, Errors: 0, Time elapsed: 0.402 sec
     [exec] [au:antunit] Target: testGetResource took 0.263 sec
     [exec] [au:antunit] Target: testLoadClass took 0.051 sec
     [exec] [au:antunit] Target: testGetResourceAsStream took 0.048 sec
     [exec] [au:antunit] Build File: <https://builds.apache.org/job/Ant-Build-Matrix/./jdk=JDK%201.7%20(latest),label=Windows/ws/trunk\src\tests\antunit\core\createtask-test.xml>
     [exec] [au:antunit] Tests run: 1, Failures: 0, Errors: 0, Time elapsed: 0.235 sec
     [exec] [au:antunit] Target: testCreateTaskInFreshProject took 0.224 sec
     [exec] [au:antunit] Build File: <https://builds.apache.org/job/Ant-Build-Matrix/./jdk=JDK%201.7%20(latest),label=Windows/ws/trunk\src\tests\antunit\core\dirscanner-symlinks-test.xml>
     [exec] [au:antunit] Tests run: 13, Failures: 0, Errors: 0, Time elapsed: 0.203 sec
     [exec] [au:antunit] Target: testRepeatedName took 0.021 sec
     [exec] [au:antunit] Target: testBasedirIsSymlinkFollow took 0.002 sec
     [exec] [au:antunit] Target: testLinkToParentFollowMax2 took 0.001 sec
     [exec] [au:antunit] Target: testLinkToParentFollow took 0.002 sec
     [exec] [au:antunit] Target: testLinkToParentFollowWithInclude took 0.001 sec
     [exec] [au:antunit] Target: testLinkToParentFollowWithIncludeMultiFollow took 0.001 sec
     [exec] [au:antunit] Target: testSymlinkToSiblingNoFollow took 0.001 sec
     [exec] [au:antunit] Target: testLinkToParentNoFollow took 0.001 sec
     [exec] [au:antunit] Target: testRepeatedNameWithLinkButNoLoop took 0.001 sec
     [exec] [au:antunit] Target: testSillyLoopFollow took 0.001 sec
     [exec] [au:antunit] Target: testBasedirIsSymlinkNoFollow took 0.001 sec
     [exec] [au:antunit] Target: testSymlinkToSiblingFollow took 0.001 sec
     [exec] [au:antunit] Target: testSillyLoopNoFollow took 0.001 sec
     [exec] [au:antunit] Build File: <https://builds.apache.org/job/Ant-Build-Matrix/./jdk=JDK%201.7%20(latest),label=Windows/ws/trunk\src\tests\antunit\core\extension-point-test.xml>
     [exec] [au:antunit] Tests run: 12, Failures: 0, Errors: 0, Time elapsed: 0.327 sec
     [exec] [au:antunit] Target: testMissingExtensionPointCausesWarningWhenConfigured took
0.009 sec
     [exec] [au:antunit] Target: testAddToExtensionPoint took 0.005 sec
     [exec] [au:antunit] Target: testExtensionPointMustBeEmpty took 0.004 sec
     [exec] [au:antunit] Target: testExtensionPointInIncludedBuildfileWithNestedInclude took
0.015 sec
     [exec] [au:antunit] Target: testMissingExtensionPointIgnoredWhenConfigured took 0.011
sec
     [exec] [au:antunit] Target: testCantAddToPlainTarget took 0.003 sec
     [exec] [au:antunit] Target: testExtensionPointInIncludedBuildfileWithNestedImport took
0.01 sec
     [exec] [au:antunit] Target: testExtensionPointInImportedBuildfileWithNestedImport took
0.012 sec
     [exec] [au:antunit] Target: testExtensionPointInImportedBuildfile took 0.005 sec
     [exec] [au:antunit] Target: testOnlyAllowsExtensionPointMissingAttributeWhenExtensionOfPresent
took 0.002 sec
     [exec] [au:antunit] Target: testExtensionPointWorksLikeTarget took 0.001 sec
     [exec] [au:antunit] Target: testMissingExtensionPointCausesError took 0.003 sec
     [exec] [au:antunit] Build File: <https://builds.apache.org/job/Ant-Build-Matrix/./jdk=JDK%201.7%20(latest),label=Windows/ws/trunk\src\tests\antunit\core\extension\include-test.xml>
     [exec] [au:antunit] Tests run: 1, Failures: 0, Errors: 0, Time elapsed: 0.008 sec
     [exec] [au:antunit] Target: testImport took 0.001 sec
     [exec] [au:antunit] Build File: <https://builds.apache.org/job/Ant-Build-Matrix/./jdk=JDK%201.7%20(latest),label=Windows/ws/trunk\src\tests\antunit\core\magic-names-test.xml>
     [exec] [au:antunit] Tests run: 4, Failures: 0, Errors: 0, Time elapsed: 0.018 sec
     [exec] [au:antunit] Target: testInvokedTargets took 0.002 sec
     [exec] [au:antunit] Target: testInvokedTargetsWithNestedAntcall took 0.004 sec
     [exec] [au:antunit] Target: testProjectName took 0.001 sec
     [exec] [au:antunit] Target: testDefaultTarget took 0.001 sec
     [exec] [au:antunit] Build File: <https://builds.apache.org/job/Ant-Build-Matrix/./jdk=JDK%201.7%20(latest),label=Windows/ws/trunk\src\tests\antunit\core\nested-elements-test.xml>
     [exec] [au:antunit] Tests run: 3, Failures: 0, Errors: 0, Time elapsed: 0.281 sec
     [exec] [au:antunit] Target: testDynamicElementNSAndTaskContainer took 0.075 sec
     [exec] [au:antunit] Target: testDynamicElementAndTaskContainer took 0.088 sec
     [exec] [au:antunit] Target: testConditionBaseAndTaskContainer took 0.081 sec
     [exec] [au:antunit] Build File: <https://builds.apache.org/job/Ant-Build-Matrix/./jdk=JDK%201.7%20(latest),label=Windows/ws/trunk\src\tests\antunit\core\nested-text-test.xml>
     [exec] [au:antunit] Tests run: 3, Failures: 0, Errors: 0, Time elapsed: 0.026 sec
     [exec] [au:antunit] Target: testNumericEntities took 0.004 sec
     [exec] [au:antunit] Target: testRejectNested took 0.002 sec
     [exec] [au:antunit] Target: testAcceptNested took 0 sec
     [exec] [au:antunit] Build File: <https://builds.apache.org/job/Ant-Build-Matrix/./jdk=JDK%201.7%20(latest),label=Windows/ws/trunk\src\tests\antunit\core\projecthelpers-test.xml>
     [exec] [au:antunit] Tests run: 3, Failures: 0, Errors: 0, Time elapsed: 0.471 sec
     [exec] [au:antunit] Target: testManyImport took 0.199 sec
     [exec] [au:antunit] Target: testCrossTargets took 0.083 sec
     [exec] [au:antunit] Target: testCrossExtension took 0.158 sec
     [exec] [au:antunit] Build File: <https://builds.apache.org/job/Ant-Build-Matrix/./jdk=JDK%201.7%20(latest),label=Windows/ws/trunk\src\tests\antunit\core\ref-propertyhelper-test.xml>
     [exec] [au:antunit] Tests run: 4, Failures: 0, Errors: 0, Time elapsed: 0.224 sec
     [exec] [au:antunit] Target: testManualExample took 0.126 sec
     [exec] [au:antunit] Target: testToString took 0.002 sec
     [exec] [au:antunit] Target: testPathObject took 0.053 sec
     [exec] [au:antunit] Target: testImplicitToString took 0.001 sec
     [exec] [au:antunit] Build File: <https://builds.apache.org/job/Ant-Build-Matrix/./jdk=JDK%201.7%20(latest),label=Windows/ws/trunk\src\tests\antunit\core\ref-psyntax-hint-test.xml>
     [exec] [au:antunit] Tests run: 1, Failures: 0, Errors: 0, Time elapsed: 0.013 sec
     [exec] [au:antunit] Target: testIt took 0.007 sec
     [exec] [au:antunit] Build File: <https://builds.apache.org/job/Ant-Build-Matrix/./jdk=JDK%201.7%20(latest),label=Windows/ws/trunk\src\tests\antunit\core\target-test.xml>
     [exec] [au:antunit] Tests run: 3, Failures: 0, Errors: 0, Time elapsed: 0.256 sec
     [exec] [au:antunit] Target: testReferencesSet took 0.117 sec
     [exec] [au:antunit] Target: testProperttiesSet took 0.056 sec
     [exec] [au:antunit] Target: testReferencesNotSet took 0.054 sec
     [exec] [au:antunit] Build File: <https://builds.apache.org/job/Ant-Build-Matrix/./jdk=JDK%201.7%20(latest),label=Windows/ws/trunk\src\tests\antunit\core\uuencode\uuencode-test.xml>
     [exec] [au:antunit] Tests run: 1, Failures: 0, Errors: 0, Time elapsed: 17.011 sec
     [exec] [au:antunit] Target: test-simple took 16.97 sec
     [exec] [au:antunit] Build File: <https://builds.apache.org/job/Ant-Build-Matrix/./jdk=JDK%201.7%20(latest),label=Windows/ws/trunk\src\tests\antunit\filters\expandproperties-test.xml>
     [exec] [au:antunit] Tests run: 4, Failures: 0, Errors: 0, Time elapsed: 0.042 sec
     [exec] [au:antunit] Target: testSubset took 0.009 sec
     [exec] [au:antunit] Target: testClassic took 0.001 sec
     [exec] [au:antunit] Target: testMappedPropertySet took 0.002 sec
     [exec] [au:antunit] Target: testEmptyResource took 0.001 sec
     [exec] [au:antunit] Build File: <https://builds.apache.org/job/Ant-Build-Matrix/./jdk=JDK%201.7%20(latest),label=Windows/ws/trunk\src\tests\antunit\filters\replacetokens-test.xml>
     [exec] #
     [exec] # There is insufficient memory for the Java Runtime Environment to continue.
     [exec] # Native memory allocation (malloc) failed to allocate 1663824 bytes for Chunk::new
     [exec] # An error report file with more information is saved as:
     [exec] # <https://builds.apache.org/job/Ant-Build-Matrix/./jdk=JDK%201.7%20(latest),label=Windows/ws/trunk\hs_err_pid11364.log>

BUILD SUCCESSFUL
Total time: 1 minute 39 seconds
Recording test results
ERROR: Failed to archive test reports
hudson.util.IOException2: remote file operation failed: <https://builds.apache.org/job/Ant-Build-Matrix/./jdk=JDK%201.7%20(latest),label=Windows/ws/>
at hudson.remoting.Channel@7bb37db5:windows1
	at hudson.FilePath.act(FilePath.java:861)
	at hudson.FilePath.act(FilePath.java:838)
	at hudson.tasks.junit.JUnitParser.parse(JUnitParser.java:87)
	at hudson.tasks.junit.JUnitResultArchiver.parse(JUnitResultArchiver.java:122)
	at hudson.tasks.junit.JUnitResultArchiver.perform(JUnitResultArchiver.java:134)
	at hudson.tasks.BuildStepMonitor$1.perform(BuildStepMonitor.java:19)
	at hudson.model.AbstractBuild$AbstractBuildExecution.perform(AbstractBuild.java:810)
	at hudson.model.AbstractBuild$AbstractBuildExecution.performAllBuildSteps(AbstractBuild.java:785)
	at hudson.model.Build$BuildExecution.post2(Build.java:183)
	at hudson.model.AbstractBuild$AbstractBuildExecution.post(AbstractBuild.java:732)
	at hudson.model.Run.execute(Run.java:1593)
	at hudson.matrix.MatrixRun.run(MatrixRun.java:146)
	at hudson.model.ResourceController.execute(ResourceController.java:88)
	at hudson.model.Executor.run(Executor.java:236)
Caused by: hudson.util.IOException2: Failed to read <https://builds.apache.org/job/Ant-Build-Matrix/./jdk=JDK%201.7%20(latest),label=Windows/ws/trunk\build\antunit\xml\TEST-src.tests.antunit.filters.replacetokens-test_xml.xml>
	at hudson.tasks.junit.TestResult.parse(TestResult.java:284)
	at hudson.tasks.junit.TestResult.parsePossiblyEmpty(TestResult.java:223)
	at hudson.tasks.junit.TestResult.parse(TestResult.java:158)
	at hudson.tasks.junit.TestResult.parse(TestResult.java:141)
	at hudson.tasks.junit.TestResult.<init>(TestResult.java:117)
	at hudson.tasks.junit.JUnitParser$ParseResultCallable.invoke(JUnitParser.java:117)
	at hudson.tasks.junit.JUnitParser$ParseResultCallable.invoke(JUnitParser.java:90)
	at hudson.FilePath$FileCallableWrapper.call(FilePath.java:2348)
	at hudson.remoting.UserRequest.perform(UserRequest.java:118)
	at hudson.remoting.UserRequest.perform(UserRequest.java:48)
	at hudson.remoting.Request$2.run(Request.java:326)
	at hudson.remoting.InterceptingExecutorService$1.call(InterceptingExecutorService.java:72)
	at java.util.concurrent.FutureTask$Sync.innerRun(Unknown Source)
	at java.util.concurrent.FutureTask.run(Unknown Source)
	at java.util.concurrent.ThreadPoolExecutor.runWorker(Unknown Source)
	at java.util.concurrent.ThreadPoolExecutor$Worker.run(Unknown Source)
	at hudson.remoting.Engine$1$1.run(Engine.java:58)
	at java.lang.Thread.run(Unknown Source)
Caused by: org.dom4j.DocumentException: Error on line 85 of document file:///f:/hudson/hudson-slave/workspace/Ant-Build-Matrix/jdk/JDK%201.7%20(latest)/label/Windows/trunk/build/antunit/xml/TEST-src.tests.antunit.filters.replacetokens-test_xml.xml
: XML document structures must start and end within the same entity. Nested exception: XML
document structures must start and end within the same entity.
	at org.dom4j.io.SAXReader.read(SAXReader.java:482)
	at org.dom4j.io.SAXReader.read(SAXReader.java:264)
	at hudson.tasks.junit.SuiteResult.parse(SuiteResult.java:129)
	at hudson.tasks.junit.TestResult.parse(TestResult.java:267)
	... 17 more
Caused by: org.xml.sax.SAXParseException; systemId: file:///f:/hudson/hudson-slave/workspace/Ant-Build-Matrix/jdk/JDK%201.7%20(latest)/label/Windows/trunk/build/antunit/xml/TEST-src.tests.antunit.filters.replacetokens-test_xml.xml;
lineNumber: 85; columnNumber: 1; XML document structures must start and end within the same
entity.
	at com.sun.org.apache.xerces.internal.util.ErrorHandlerWrapper.createSAXParseException(Unknown
Source)
	at com.sun.org.apache.xerces.internal.util.ErrorHandlerWrapper.fatalError(Unknown Source)
	at com.sun.org.apache.xerces.internal.impl.XMLErrorReporter.reportError(Unknown Source)
	at com.sun.org.apache.xerces.internal.impl.XMLErrorReporter.reportError(Unknown Source)
	at com.sun.org.apache.xerces.internal.impl.XMLScanner.reportFatalError(Unknown Source)
	at com.sun.org.apache.xerces.internal.impl.XMLDocumentFragmentScannerImpl.endEntity(Unknown
Source)
	at com.sun.org.apache.xerces.internal.impl.XMLDocumentScannerImpl.endEntity(Unknown Source)
	at com.sun.org.apache.xerces.internal.impl.XMLEntityManager.endEntity(Unknown Source)
	at com.sun.org.apache.xerces.internal.impl.XMLEntityScanner.load(Unknown Source)
	at com.sun.org.apache.xerces.internal.impl.XMLEntityScanner.skipChar(Unknown Source)
	at com.sun.org.apache.xerces.internal.impl.XMLDocumentFragmentScannerImpl$FragmentContentDriver.next(Unknown
Source)
	at com.sun.org.apache.xerces.internal.impl.XMLDocumentScannerImpl.next(Unknown Source)
	at com.sun.org.apache.xerces.internal.impl.XMLNSDocumentScannerImpl.next(Unknown Source)
	at com.sun.org.apache.xerces.internal.impl.XMLDocumentFragmentScannerImpl.scanDocument(Unknown
Source)
	at com.sun.org.apache.xerces.internal.parsers.XML11Configuration.parse(Unknown Source)
	at com.sun.org.apache.xerces.internal.parsers.XML11Configuration.parse(Unknown Source)
	at com.sun.org.apache.xerces.internal.parsers.XMLParser.parse(Unknown Source)
	at com.sun.org.apache.xerces.internal.parsers.AbstractSAXParser.parse(Unknown Source)
	at com.sun.org.apache.xerces.internal.jaxp.SAXParserImpl$JAXPSAXParser.parse(Unknown Source)
	at org.dom4j.io.SAXReader.read(SAXReader.java:465)
	... 20 more
Build step 'Publish JUnit test result report' changed build result to FAILURE

Mime
View raw message