ant-notifications mailing list archives

Site index · List index
Message view « Date » · « Thread »
Top « Date » · « Thread »
From Apache Jenkins Server <jenk...@builds.apache.org>
Subject Build failed in Jenkins: Ant-Build-Matrix » JDK 1.6 (latest),Windows #553
Date Tue, 05 Mar 2013 12:56:59 GMT
See <https://builds.apache.org/job/Ant-Build-Matrix/./jdk=JDK%201.6%20(latest),label=Windows/553/changes>

Changes:

[antoine] adding hamcrest to the lib/optional because it is required at runtime for some tests,
also bumping junit dependency in pom file

------------------------------------------
[...truncated 788 lines...]
     [exec] [au:antunit] Target: testPropertySet took 0.859 sec
     [exec] [au:antunit] Target: testPropertyNotSet took 0.461 sec
     [exec] [au:antunit] Target: testPropertyFalse took 0.456 sec
     [exec] [au:antunit] Target: testPropertyTrue took 0.467 sec
     [exec] [au:antunit] Build File: <https://builds.apache.org/job/Ant-Build-Matrix/./jdk=JDK%201.6%20(latest),label=Windows/ws/trunk\src\tests\antunit\taskdefs\optional\junit\junit-outputtoformatters-test.xml>
     [exec] [au:antunit] Tests run: 7, Failures: 3, Errors: 0, Time elapsed: 1.937 sec
     [exec] [au:antunit] Target: test-show-yes-formatters-no  FAILED
     [exec] [au:antunit] 	at line 90, column 27
     [exec] [au:antunit] 	Message: Expected log to contain 'Hello From Test' at level info
     [exec] [au:antunit] 	took 0.461 sec
     [exec] [au:antunit] Target: test-show-no-formatters-yes  FAILED
     [exec] [au:antunit] 	at line 119, column 28
     [exec] [au:antunit] 	Message: Assertion failed
     [exec] [au:antunit] 	took 0.45 sec
     [exec] [au:antunit] Target: test-show-no-formatters-no-fork-no took 0.033 sec
     [exec] [au:antunit] Target: test-show-no-formatters-yes-fork-no took 0.03 sec
     [exec] [au:antunit] Target: test-show-yes-formatters-no-forkno took 0.032 sec
     [exec] [au:antunit] Target: test-show-yes-formatters-yes  FAILED
     [exec] [au:antunit] 	at line 83, column 27
     [exec] [au:antunit] 	Message: Expected log to contain 'Hello From Test' at level info
     [exec] [au:antunit] 	took 0.447 sec
     [exec] [au:antunit] Target: test-show-no-formatters-no took 0.449 sec
     [exec] [au:antunit] Build File: <https://builds.apache.org/job/Ant-Build-Matrix/./jdk=JDK%201.6%20(latest),label=Windows/ws/trunk\src\tests\antunit\taskdefs\optional\junit\junit-test.xml>
     [exec] [au:antunit] Tests run: 11, Failures: 6, Errors: 1, Time elapsed: 9.765 sec
     [exec] [au:antunit] Target: testTimeoutAndFormattersForkOnce  FAILED
     [exec] [au:antunit] 	at line 201, column 65
     [exec] [au:antunit] 	Message: Expected file '<https://builds.apache.org/job/Ant-Build-Matrix/./jdk=JDK%201.6%20(latest),label=Windows/ws/trunk\build\antunit\tmp\testoutput/TEST-test.ATest.txt'>
to exist
     [exec] [au:antunit] 	took 0.524 sec
     [exec] [au:antunit] Target: testFailurePropertyOnTestSuite took 0.151 sec
     [exec] [au:antunit] Target: testTestMethods  caused an ERROR
     [exec] [au:antunit] 	at line 333, column 63
     [exec] [au:antunit] 	Message: Test T1 failed (crashed)
     [exec] [au:antunit] 	took 0.477 sec
     [exec] [au:antunit] Target: testTimeoutAndFormattersForkPerTest took 2.008 sec
     [exec] [au:antunit] Target: testPropertiesSet  FAILED
     [exec] [au:antunit] 	at line 269, column 55
     [exec] [au:antunit] 	Message: Expected log to contain 'Running test.BTest' at level info
     [exec] [au:antunit] 	took 1.447 sec
     [exec] [au:antunit] Target: testMissingTestName took 0.001 sec
     [exec] [au:antunit] Target: testPropertiesTrue  FAILED
     [exec] [au:antunit] 	at line 281, column 55
     [exec] [au:antunit] 	Message: Expected log to contain 'Running test.ATest' at level info
     [exec] [au:antunit] 	took 1.363 sec
     [exec] [au:antunit] Target: testPropertiesNotSet  FAILED
     [exec] [au:antunit] 	at line 257, column 55
     [exec] [au:antunit] 	Message: Expected log to contain 'Running test.CTest' at level info
     [exec] [au:antunit] 	took 1.381 sec
     [exec] [au:antunit] Target: testPropertiesFalse  FAILED
     [exec] [au:antunit] 	at line 295, column 55
     [exec] [au:antunit] 	Message: Expected log to contain 'Running test.BTest' at level info
     [exec] [au:antunit] 	took 1.356 sec
     [exec] [au:antunit] Target: testTimeoutLogOfBatchTests  FAILED
     [exec] [au:antunit] 	at line 78, column 42
     [exec] [au:antunit] 	Message: Expected log to contain 'ATest' at level info
     [exec] [au:antunit] 	took 0.526 sec
     [exec] [au:antunit] Target: testFailurePropertyOnTestCase took 0.028 sec
     [exec] [au:antunit] Build File: <https://builds.apache.org/job/Ant-Build-Matrix/./jdk=JDK%201.6%20(latest),label=Windows/ws/trunk\src\tests\antunit\taskdefs\optional\junit\xmlformatter-test.xml>
     [exec] [au:antunit] Tests run: 3, Failures: 2, Errors: 0, Time elapsed: 1.441 sec
     [exec] [au:antunit] Target: testEntities  FAILED
     [exec] [au:antunit] 	at line 179, column 37
     [exec] [au:antunit] 	Message: Expected resource '<https://builds.apache.org/job/Ant-Build-Matrix/./jdk=JDK%201.6%20(latest),label=Windows/ws/trunk\build\antunit\tmp\testoutput/TEST-org.example.A.xml'>
to contain value 'message="&amp;amp;&amp;' but was '${<https://builds.apache.org/job/Ant-Build-Matrix/./jdk=JDK%201.6%20(latest),label=Windows/ws/trunk\build\antunit\tmp\testoutput/TEST-org.example.A.xml}'>
     [exec] [au:antunit] 	took 0.473 sec
     [exec] [au:antunit] Target: test0Character took 0.498 sec
     [exec] [au:antunit] Target: testMessageWithTheWordMore  FAILED
     [exec] [au:antunit] 	at line 179, column 37
     [exec] [au:antunit] 	Message: Expected resource '<https://builds.apache.org/job/Ant-Build-Matrix/./jdk=JDK%201.6%20(latest),label=Windows/ws/trunk\build\antunit\tmp\testoutput/TEST-org.example.A.xml'>
to contain value 'junit.framework.AssertionFailedError: Expected less than one result' but
was '${<https://builds.apache.org/job/Ant-Build-Matrix/./jdk=JDK%201.6%20(latest),label=Windows/ws/trunk\build\antunit\tmp\testoutput/TEST-org.example.A.xml}'>
     [exec] [au:antunit] 	took 0.453 sec
     [exec] [au:antunit] Build File: <https://builds.apache.org/job/Ant-Build-Matrix/./jdk=JDK%201.6%20(latest),label=Windows/ws/trunk\src\tests\antunit\taskdefs\optional\native2ascii-test.xml>
     [exec] [au:antunit] Tests run: 3, Failures: 0, Errors: 0, Time elapsed: 0.125 sec
     [exec] [au:antunit] Target: testImplementationClasspath took 0.041 sec
     [exec] [au:antunit] Target: testAdapterNotFound took 0.034 sec
     [exec] [au:antunit] Target: testImplementationAsNestedElement took 0.035 sec
     [exec] [au:antunit] Build File: <https://builds.apache.org/job/Ant-Build-Matrix/./jdk=JDK%201.6%20(latest),label=Windows/ws/trunk\src\tests\antunit\taskdefs\optional\propertyfile-test.xml>
     [exec] [au:antunit] Tests run: 1, Failures: 0, Errors: 0, Time elapsed: 0.024 sec
     [exec] [au:antunit] Target: testReadWithPrefix took 0.02 sec
     [exec] [au:antunit] Build File: <https://builds.apache.org/job/Ant-Build-Matrix/./jdk=JDK%201.6%20(latest),label=Windows/ws/trunk\src\tests\antunit\taskdefs\optional\propertyfilelayout-test.xml>
     [exec] [au:antunit] Tests run: 10, Failures: 0, Errors: 0, Time elapsed: 0.225 sec
     [exec] [au:antunit] Target: testPreservesUnixLineEnds took 0.027 sec
     [exec] [au:antunit] Target: testCreateWithoutComment took 0.007 sec
     [exec] [au:antunit] Target: testUpdateWithoutComment took 0.005 sec
     [exec] [au:antunit] Target: testUpdateWithNewComment took 0.006 sec
     [exec] [au:antunit] Target: testPreservesDosLineEnds took 0.028 sec
     [exec] [au:antunit] Target: testRepeatedUpdateWithSameComment took 0.008 sec
     [exec] [au:antunit] Target: testCreateWithComment took 0.007 sec
     [exec] [au:antunit] Target: testPreservesMacLineEnds took 0.01 sec
     [exec] [au:antunit] Target: testUpdateWithSameComment took 0.011 sec
     [exec] [au:antunit] Target: testRepeatedUpdateWithoutComment took 0.009 sec
     [exec] [au:antunit] Build File: <https://builds.apache.org/job/Ant-Build-Matrix/./jdk=JDK%201.6%20(latest),label=Windows/ws/trunk\src\tests\antunit\taskdefs\optional\replaceregexp-test.xml>
     [exec] [au:antunit] Tests run: 1, Failures: 0, Errors: 0, Time elapsed: 0.013 sec
     [exec] [au:antunit] Target: testRCSupport took 0.006 sec
     [exec] [au:antunit] Build File: <https://builds.apache.org/job/Ant-Build-Matrix/./jdk=JDK%201.6%20(latest),label=Windows/ws/trunk\src\tests\antunit\taskdefs\optional\script\scriptdef-test.xml>
     [exec] [au:antunit] Tests run: 7, Failures: 0, Errors: 0, Time elapsed: 0.207 sec
     [exec] [au:antunit] Target: testExceptionNesting took 0.132 sec
     [exec] [au:antunit] Target: testMixedResources took 0.007 sec
     [exec] [au:antunit] Target: testInline took 0.004 sec
     [exec] [au:antunit] Target: testStringResourceRef took 0.005 sec
     [exec] [au:antunit] Target: testPropertyResource took 0.005 sec
     [exec] [au:antunit] Target: testStringResource took 0.003 sec
     [exec] [au:antunit] Target: testStringResourceInline took 0.005 sec
     [exec] [au:antunit] Build File: <https://builds.apache.org/job/Ant-Build-Matrix/./jdk=JDK%201.6%20(latest),label=Windows/ws/trunk\src\tests\antunit\taskdefs\optional\unix\symlink-test.xml>
     [exec] [au:antunit] Tests run: 7, Failures: 0, Errors: 0, Time elapsed: 0.09 sec
     [exec] [au:antunit] Target: testCreateDouble took 0.001 sec
     [exec] [au:antunit] Target: testCreateOverFile took 0 sec
     [exec] [au:antunit] Target: testDeleteLinkInSameDirAsBuildFile took 0 sec
     [exec] [au:antunit] Target: testCreateDoubleHanging took 0 sec
     [exec] [au:antunit] Target: testDeleteWithNoPermissionToRenameTarget took 0 sec
     [exec] [au:antunit] Target: testDeleteOfBrokenLink took 0.001 sec
     [exec] [au:antunit] Target: testDeleteLinkToParent took 0.001 sec
     [exec] [au:antunit] Build File: <https://builds.apache.org/job/Ant-Build-Matrix/./jdk=JDK%201.6%20(latest),label=Windows/ws/trunk\src\tests\antunit\taskdefs\optional\windows\attrib-test.xml>
     [exec] [au:antunit] Tests run: 1, Failures: 0, Errors: 0, Time elapsed: 4.4 sec
     [exec] [au:antunit] Target: testPerformance took 4.296 sec
     [exec] [au:antunit] Build File: <https://builds.apache.org/job/Ant-Build-Matrix/./jdk=JDK%201.6%20(latest),label=Windows/ws/trunk\src\tests\antunit\taskdefs\parallel-test.xml>
     [exec] [au:antunit] Tests run: 1, Failures: 0, Errors: 0, Time elapsed: 2.009 sec
     [exec] [au:antunit] Target: testTimeout took 2.005 sec
     [exec] [au:antunit] Build File: <https://builds.apache.org/job/Ant-Build-Matrix/./jdk=JDK%201.6%20(latest),label=Windows/ws/trunk\src\tests\antunit\taskdefs\pathconvert-test.xml>
     [exec] [au:antunit] Tests run: 1, Failures: 0, Errors: 0, Time elapsed: 0.004 sec
     [exec] [au:antunit] Target: test-dir-char took 0.001 sec
     [exec] [au:antunit] Build File: <https://builds.apache.org/job/Ant-Build-Matrix/./jdk=JDK%201.6%20(latest),label=Windows/ws/trunk\src\tests\antunit\taskdefs\property-test.xml>
     [exec] [au:antunit] Tests run: 13, Failures: 0, Errors: 0, Time elapsed: 0.153 sec
     [exec] [au:antunit] Target: testRelativeUnderBase took 0.006 sec
     [exec] [au:antunit] Target: testMultiplePrefixes took 0.002 sec
     [exec] [au:antunit] Target: testNestedTextAndValueAttribute took 0 sec
     [exec] [au:antunit] Target: testLocationWithRecursive took 0 sec
     [exec] [au:antunit] Target: testRelative took 0.002 sec
     [exec] [au:antunit] Target: testNestedExpansionHonorsImmutability took 0.009 sec
     [exec] [au:antunit] Target: testRelativeOverBase took 0 sec
     [exec] [au:antunit] Target: testRelativeBase took 0.001 sec
     [exec] [au:antunit] Target: testLocation took 0.001 sec
     [exec] [au:antunit] Target: testNoNestedTextButValueAttribute took 0 sec
     [exec] [au:antunit] Target: testNestedExpansionDoesntUsePrefix took 0.001 sec
     [exec] [au:antunit] Target: testNestedText took 0 sec
     [exec] [au:antunit] Target: testRelativeUnderBase2 took 0.001 sec
     [exec] [au:antunit] Build File: <https://builds.apache.org/job/Ant-Build-Matrix/./jdk=JDK%201.6%20(latest),label=Windows/ws/trunk\src\tests\antunit\taskdefs\propertyfile-test.xml>
     [exec] [au:antunit] Tests run: 1, Failures: 0, Errors: 0, Time elapsed: 0.007 sec
     [exec] [au:antunit] Target: testInternationalText took 0.002 sec
     [exec] [au:antunit] Build File: <https://builds.apache.org/job/Ant-Build-Matrix/./jdk=JDK%201.6%20(latest),label=Windows/ws/trunk\src\tests\antunit\taskdefs\propertyhelper-test.xml>
     [exec] [au:antunit] Tests run: 6, Failures: 0, Errors: 0, Time elapsed: 0.025 sec
     [exec] [au:antunit] Target: testValueTypes took 0 sec
     [exec] [au:antunit] Target: testLoadPropertiesWithStrings took 0 sec
     [exec] [au:antunit] Target: testAvailable took 0 sec
     [exec] [au:antunit] Target: testCondition took 0 sec
     [exec] [au:antunit] Target: testEmbeddedNonString took 0 sec
     [exec] [au:antunit] Target: testNull took 0 sec
     [exec] [au:antunit] Build File: <https://builds.apache.org/job/Ant-Build-Matrix/./jdk=JDK%201.6%20(latest),label=Windows/ws/trunk\src\tests\antunit\taskdefs\replace-test.xml>
     [exec] [au:antunit] Tests run: 7, Failures: 0, Errors: 0, Time elapsed: 0.19 sec
     [exec] [au:antunit] Target: testFailOnNoReplace took 0.009 sec
     [exec] [au:antunit] Target: testPropertyExpansion took 0.003 sec
     [exec] [au:antunit] Target: testNoReplace took 0.002 sec
     [exec] [au:antunit] Target: testRCSupport took 0.002 sec
     [exec] [au:antunit] Target: testPropertyFilterResource took 0.132 sec
     [exec] [au:antunit] Target: testNoPropertyExpansion took 0.002 sec
     [exec] [au:antunit] Target: testNestedElementsOfFilter took 0.003 sec
     [exec] [au:antunit] Build File: <https://builds.apache.org/job/Ant-Build-Matrix/./jdk=JDK%201.6%20(latest),label=Windows/ws/trunk\src\tests\antunit\taskdefs\retry-test.xml>
     [exec] [au:antunit] Tests run: 2, Failures: 0, Errors: 0, Time elapsed: 2.663 sec
     [exec] [au:antunit] Target: test-success took 0.002 sec
     [exec] [au:antunit] Target: test-fail-and-retry took 2.557 sec
     [exec] [au:antunit] Build File: <https://builds.apache.org/job/Ant-Build-Matrix/./jdk=JDK%201.6%20(latest),label=Windows/ws/trunk\src\tests\antunit\taskdefs\rmic-test.xml>
     [exec] [au:antunit] Tests run: 4, Failures: 0, Errors: 0, Time elapsed: 0.851 sec
     [exec] [au:antunit] Target: testCompilerClasspath took 0.065 sec
     [exec] [au:antunit] Target: testCompilerAsNestedElement took 0.036 sec
     [exec] [au:antunit] Target: testCompilerNotFound took 0.034 sec
     [exec] [au:antunit] Target: testSourceBase took 0.653 sec
     [exec] [au:antunit] Build File: <https://builds.apache.org/job/Ant-Build-Matrix/./jdk=JDK%201.6%20(latest),label=Windows/ws/trunk\src\tests\antunit\taskdefs\signjar-test.xml>
     [exec] #
     [exec] # A fatal error has been detected by the Java Runtime Environment:
     [exec] #
     [exec] #  EXCEPTION_ACCESS_VIOLATION (0xc0000005) at pc=0x000000006da7978c, pid=17732,
tid=14720
     [exec] #
     [exec] # JRE version: 6.0_27-b07
     [exec] # Java VM: Java HotSpot(TM) 64-Bit Server VM (20.2-b06 mixed mode windows-amd64
compressed oops)
     [exec] # Problematic frame:
     [exec] # V  [jvm.dll+0x1e978c]
     [exec] 
     [exec] [error occurred during error reporting (printing problematic frame), id 0xc0000005]
     [exec] 
     [exec] # An error report file with more information is saved as:
     [exec] # <https://builds.apache.org/job/Ant-Build-Matrix/./jdk=JDK%201.6%20(latest),label=Windows/ws/trunk\hs_err_pid17732.log>
     [exec] #
     [exec] # If you would like to submit a bug report, please visit:
     [exec] #   http://java.sun.com/webapps/bugreport/crash.jsp
     [exec] #

BUILD SUCCESSFUL
Total time: 4 minutes 12 seconds
Recording test results
ERROR: Failed to archive test reports
hudson.util.IOException2: remote file operation failed: <https://builds.apache.org/job/Ant-Build-Matrix/./jdk=JDK%201.6%20(latest),label=Windows/ws/>
at hudson.remoting.Channel@7bb37db5:windows1
	at hudson.FilePath.act(FilePath.java:861)
	at hudson.FilePath.act(FilePath.java:838)
	at hudson.tasks.junit.JUnitParser.parse(JUnitParser.java:87)
	at hudson.tasks.junit.JUnitResultArchiver.parse(JUnitResultArchiver.java:122)
	at hudson.tasks.junit.JUnitResultArchiver.perform(JUnitResultArchiver.java:134)
	at hudson.tasks.BuildStepMonitor$1.perform(BuildStepMonitor.java:19)
	at hudson.model.AbstractBuild$AbstractBuildExecution.perform(AbstractBuild.java:810)
	at hudson.model.AbstractBuild$AbstractBuildExecution.performAllBuildSteps(AbstractBuild.java:785)
	at hudson.model.Build$BuildExecution.post2(Build.java:183)
	at hudson.model.AbstractBuild$AbstractBuildExecution.post(AbstractBuild.java:732)
	at hudson.model.Run.execute(Run.java:1593)
	at hudson.matrix.MatrixRun.run(MatrixRun.java:146)
	at hudson.model.ResourceController.execute(ResourceController.java:88)
	at hudson.model.Executor.run(Executor.java:236)
Caused by: hudson.util.IOException2: Failed to read <https://builds.apache.org/job/Ant-Build-Matrix/./jdk=JDK%201.6%20(latest),label=Windows/ws/trunk\build\antunit\xml\TEST-src.tests.antunit.taskdefs.signjar-test_xml.xml>
	at hudson.tasks.junit.TestResult.parse(TestResult.java:284)
	at hudson.tasks.junit.TestResult.parsePossiblyEmpty(TestResult.java:223)
	at hudson.tasks.junit.TestResult.parse(TestResult.java:158)
	at hudson.tasks.junit.TestResult.parse(TestResult.java:141)
	at hudson.tasks.junit.TestResult.<init>(TestResult.java:117)
	at hudson.tasks.junit.JUnitParser$ParseResultCallable.invoke(JUnitParser.java:117)
	at hudson.tasks.junit.JUnitParser$ParseResultCallable.invoke(JUnitParser.java:90)
	at hudson.FilePath$FileCallableWrapper.call(FilePath.java:2348)
	at hudson.remoting.UserRequest.perform(UserRequest.java:118)
	at hudson.remoting.UserRequest.perform(UserRequest.java:48)
	at hudson.remoting.Request$2.run(Request.java:326)
	at hudson.remoting.InterceptingExecutorService$1.call(InterceptingExecutorService.java:72)
	at java.util.concurrent.FutureTask$Sync.innerRun(Unknown Source)
	at java.util.concurrent.FutureTask.run(Unknown Source)
	at java.util.concurrent.ThreadPoolExecutor.runWorker(Unknown Source)
	at java.util.concurrent.ThreadPoolExecutor$Worker.run(Unknown Source)
	at hudson.remoting.Engine$1$1.run(Engine.java:58)
	at java.lang.Thread.run(Unknown Source)
Caused by: org.dom4j.DocumentException: Error on line 654 of document file:///f:/hudson/hudson-slave/workspace/Ant-Build-Matrix/jdk/JDK%201.6%20(latest)/label/Windows/trunk/build/antunit/xml/TEST-src.tests.antunit.taskdefs.signjar-test_xml.xml
: XML document structures must start and end within the same entity. Nested exception: XML
document structures must start and end within the same entity.
	at org.dom4j.io.SAXReader.read(SAXReader.java:482)
	at org.dom4j.io.SAXReader.read(SAXReader.java:264)
	at hudson.tasks.junit.SuiteResult.parse(SuiteResult.java:129)
	at hudson.tasks.junit.TestResult.parse(TestResult.java:267)
	... 17 more
Caused by: org.xml.sax.SAXParseException; systemId: file:///f:/hudson/hudson-slave/workspace/Ant-Build-Matrix/jdk/JDK%201.6%20(latest)/label/Windows/trunk/build/antunit/xml/TEST-src.tests.antunit.taskdefs.signjar-test_xml.xml;
lineNumber: 654; columnNumber: 1; XML document structures must start and end within the same
entity.
	at com.sun.org.apache.xerces.internal.util.ErrorHandlerWrapper.createSAXParseException(Unknown
Source)
	at com.sun.org.apache.xerces.internal.util.ErrorHandlerWrapper.fatalError(Unknown Source)
	at com.sun.org.apache.xerces.internal.impl.XMLErrorReporter.reportError(Unknown Source)
	at com.sun.org.apache.xerces.internal.impl.XMLErrorReporter.reportError(Unknown Source)
	at com.sun.org.apache.xerces.internal.impl.XMLScanner.reportFatalError(Unknown Source)
	at com.sun.org.apache.xerces.internal.impl.XMLDocumentFragmentScannerImpl.endEntity(Unknown
Source)
	at com.sun.org.apache.xerces.internal.impl.XMLDocumentScannerImpl.endEntity(Unknown Source)
	at com.sun.org.apache.xerces.internal.impl.XMLEntityManager.endEntity(Unknown Source)
	at com.sun.org.apache.xerces.internal.impl.XMLEntityScanner.load(Unknown Source)
	at com.sun.org.apache.xerces.internal.impl.XMLEntityScanner.skipChar(Unknown Source)
	at com.sun.org.apache.xerces.internal.impl.XMLDocumentFragmentScannerImpl$FragmentContentDriver.next(Unknown
Source)
	at com.sun.org.apache.xerces.internal.impl.XMLDocumentScannerImpl.next(Unknown Source)
	at com.sun.org.apache.xerces.internal.impl.XMLNSDocumentScannerImpl.next(Unknown Source)
	at com.sun.org.apache.xerces.internal.impl.XMLDocumentFragmentScannerImpl.scanDocument(Unknown
Source)
	at com.sun.org.apache.xerces.internal.parsers.XML11Configuration.parse(Unknown Source)
	at com.sun.org.apache.xerces.internal.parsers.XML11Configuration.parse(Unknown Source)
	at com.sun.org.apache.xerces.internal.parsers.XMLParser.parse(Unknown Source)
	at com.sun.org.apache.xerces.internal.parsers.AbstractSAXParser.parse(Unknown Source)
	at com.sun.org.apache.xerces.internal.jaxp.SAXParserImpl$JAXPSAXParser.parse(Unknown Source)
	at org.dom4j.io.SAXReader.read(SAXReader.java:465)
	... 20 more
Build step 'Publish JUnit test result report' changed build result to FAILURE

Mime
View raw message