ant-notifications mailing list archives

Site index · List index
Message view « Date » · « Thread »
Top « Date » · « Thread »
From Apache Jenkins Server <jenk...@builds.apache.org>
Subject Build failed in Jenkins: Ant-Build-Matrix » JDK 1.5 (latest),Windows #553
Date Tue, 05 Mar 2013 12:52:21 GMT
See <https://builds.apache.org/job/Ant-Build-Matrix/./jdk=JDK%201.5%20(latest),label=Windows/553/changes>

Changes:

[antoine] adding hamcrest to the lib/optional because it is required at runtime for some tests,
also bumping junit dependency in pom file

------------------------------------------
Started by upstream project "Ant-Build-Matrix" build number 553
originally caused by: 
 Started by an SCM change
Building remotely on windows1 in workspace <https://builds.apache.org/job/Ant-Build-Matrix/./jdk=JDK%201.5%20(latest),label=Windows/ws/>
Cleaning up <https://builds.apache.org/job/Ant-Build-Matrix/./jdk=JDK%201.5%20(latest),label=Windows/ws/trunk>
Deleting <https://builds.apache.org/job/Ant-Build-Matrix/./jdk=JDK%201.5%20(latest),label=Windows/ws/trunk\build>
Updating http://svn.apache.org/repos/asf/ant/core/trunk
U         src\etc\testcases\taskdefs\optional\junit.xml
U         src\etc\poms\ant-junit4\pom.xml
U         WHATSNEW
AU        lib\optional\hamcrest-core-1.3.jar
At revision 1452775
[trunk] $ cmd.exe /C '"f:\hudson\hudson-slave\tools\hudson.tasks.Ant_AntInstallation\ant-1.8.2\bin\ant.bat
-file launch-build.xml -Dlabel=Windows "-Djdk=JDK 1.5 (latest)" "-Dargs=allclean test -Dignore.tests.failed=true
-Doptional.jars.whenmanifestonly=skip" && exit %%ERRORLEVEL%%"'
Buildfile: <https://builds.apache.org/job/Ant-Build-Matrix/./jdk=JDK%201.5%20(latest),label=Windows/ws/trunk\launch-build.xml>

launch:
     [echo] Launching build.bat allclean test -Dignore.tests.failed=true -Doptional.jars.whenmanifestonly=skip
     [exec] The command attribute is deprecated.
     [exec] Please use the executable attribute and nested arg elements.
     [exec] 
     [exec] ... Bootstrapping Ant Distribution
     [exec] JAVA_HOME=f:\hudson\tools\java\latest-1.5-64
     [exec] JAVA=f:\hudson\tools\java\latest-1.5-64\bin\java
     [exec] JAVAC=f:\hudson\tools\java\latest-1.5-64\bin\javac
     [exec] CLASSPATH=;lib\optional\ant-antunit-1.2.jar;lib\optional\hamcrest-core-1.3.jar;lib\optional\junit-3.8.2.jar;lib\optional\junit-4.11.jar;f:\hudson\tools\java\latest-1.5-64\lib\tools.jar;build\classes;src\main;
     [exec] 
     [exec] ... Compiling Ant Classes
     [exec] Note: Some input files use or override a deprecated API.
     [exec] Note: Recompile with -Xlint:deprecation for details.
     [exec] Note: Some input files use unchecked or unsafe operations.
     [exec] Note: Recompile with -Xlint:unchecked for details.
     [exec] 
     [exec] ... Copying Required Files
     [exec] src\main\org\apache\tools\ant\taskdefs\defaults.properties
     [exec]         1 file(s) copied.
     [exec] src\main\org\apache\tools\ant\types\defaults.properties
     [exec]         1 file(s) copied.
     [exec] 
     [exec] ... Building Ant Distribution
     [exec] Buildfile: <https://builds.apache.org/job/Ant-Build-Matrix/./jdk=JDK%201.5%20(latest),label=Windows/ws/trunk\build.xml>
     [exec] 
     [exec] bootstrap:
     [exec] 
     [exec] prepare:
     [exec] 
     [exec] check_for_optional_packages:
     [exec] 
     [exec] build:
     [exec] Created dir: <https://builds.apache.org/job/Ant-Build-Matrix/./jdk=JDK%201.5%20(latest),label=Windows/ws/trunk\build\lib>
     [exec] Compiling 260 source files to <https://builds.apache.org/job/Ant-Build-Matrix/./jdk=JDK%201.5%20(latest),label=Windows/ws/trunk\build\classes>
     [exec] <https://builds.apache.org/job/Ant-Build-Matrix/./jdk=JDK%201.5%20(latest),label=Windows/ws/trunk\src\main\org\apache\tools\ant\taskdefs\optional\junit\BriefJUnitResultFormatter.java>:282:
cannot find symbol
     [exec] symbol  : method isEmpty()
     [exec] location: class java.lang.String
     [exec]             if (annotation != null && annotation.value() != null &&
!annotation.value().isEmpty()) {
     [exec]                                                                              
       ^
     [exec] <https://builds.apache.org/job/Ant-Build-Matrix/./jdk=JDK%201.5%20(latest),label=Windows/ws/trunk\src\main\org\apache\tools\ant\taskdefs\optional\junit\BriefJUnitResultFormatter.java>:276:
method does not override a method from its superclass
     [exec]     @Override
     [exec]      ^
     [exec] <https://builds.apache.org/job/Ant-Build-Matrix/./jdk=JDK%201.5%20(latest),label=Windows/ws/trunk\src\main\org\apache\tools\ant\taskdefs\optional\junit\BriefJUnitResultFormatter.java>:308:
method does not override a method from its superclass
     [exec]     @Override
     [exec]      ^
     [exec] <https://builds.apache.org/job/Ant-Build-Matrix/./jdk=JDK%201.5%20(latest),label=Windows/ws/trunk\src\main\org\apache\tools\ant\taskdefs\optional\junit\TestListenerWrapper.java>:39:
method does not override a method from its superclass
     [exec]     @Override
     [exec]      ^
     [exec] <https://builds.apache.org/job/Ant-Build-Matrix/./jdk=JDK%201.5%20(latest),label=Windows/ws/trunk\src\main\org\apache\tools\ant\taskdefs\optional\junit\TestListenerWrapper.java>:44:
method does not override a method from its superclass
     [exec]     @Override
     [exec]      ^
     [exec] <https://builds.apache.org/job/Ant-Build-Matrix/./jdk=JDK%201.5%20(latest),label=Windows/ws/trunk\src\main\org\apache\tools\ant\taskdefs\optional\junit\TestListenerWrapper.java>:49:
method does not override a method from its superclass
     [exec]     @Override
     [exec]      ^
     [exec] <https://builds.apache.org/job/Ant-Build-Matrix/./jdk=JDK%201.5%20(latest),label=Windows/ws/trunk\src\main\org\apache\tools\ant\taskdefs\optional\junit\TestListenerWrapper.java>:54:
method does not override a method from its superclass
     [exec]     @Override
     [exec]      ^
     [exec] <https://builds.apache.org/job/Ant-Build-Matrix/./jdk=JDK%201.5%20(latest),label=Windows/ws/trunk\src\main\org\apache\tools\ant\taskdefs\optional\junit\TestListenerWrapper.java>:59:
method does not override a method from its superclass
     [exec]     @Override
     [exec]      ^
     [exec] <https://builds.apache.org/job/Ant-Build-Matrix/./jdk=JDK%201.5%20(latest),label=Windows/ws/trunk\src\main\org\apache\tools\ant\taskdefs\optional\junit\TestListenerWrapper.java>:66:
method does not override a method from its superclass
     [exec]     @Override
     [exec]      ^
     [exec] <https://builds.apache.org/job/Ant-Build-Matrix/./jdk=JDK%201.5%20(latest),label=Windows/ws/trunk\src\main\org\apache\tools\ant\taskdefs\optional\junit\PlainJUnitResultFormatter.java>:272:
cannot find symbol
     [exec] symbol  : method isEmpty()
     [exec] location: class java.lang.String
     [exec]             if (annotation != null && annotation.value() != null &&
!annotation.value().isEmpty()) {
     [exec]                                                                              
       ^
     [exec] <https://builds.apache.org/job/Ant-Build-Matrix/./jdk=JDK%201.5%20(latest),label=Windows/ws/trunk\src\main\org\apache\tools\ant\taskdefs\optional\junit\PlainJUnitResultFormatter.java>:266:
method does not override a method from its superclass
     [exec]     @Override
     [exec]      ^
     [exec] <https://builds.apache.org/job/Ant-Build-Matrix/./jdk=JDK%201.5%20(latest),label=Windows/ws/trunk\src\main\org\apache\tools\ant\taskdefs\optional\junit\PlainJUnitResultFormatter.java>:298:
method does not override a method from its superclass
     [exec]     @Override
     [exec]      ^
     [exec] <https://builds.apache.org/job/Ant-Build-Matrix/./jdk=JDK%201.5%20(latest),label=Windows/ws/trunk\src\main\org\apache\tools\ant\taskdefs\optional\junit\XMLJUnitResultFormatter.java>:339:
cannot find symbol
     [exec] symbol  : method isEmpty()
     [exec] location: class java.lang.String
     [exec]                 if (annotation != null && annotation.value() != null &&
!annotation.value().isEmpty()) {
     [exec]                                                                              
           ^
     [exec] <https://builds.apache.org/job/Ant-Build-Matrix/./jdk=JDK%201.5%20(latest),label=Windows/ws/trunk\src\main\org\apache\tools\ant\taskdefs\optional\junit\XMLJUnitResultFormatter.java>:325:
method does not override a method from its superclass
     [exec]     @Override
     [exec]      ^
     [exec] <https://builds.apache.org/job/Ant-Build-Matrix/./jdk=JDK%201.5%20(latest),label=Windows/ws/trunk\src\main\org\apache\tools\ant\taskdefs\optional\junit\XMLJUnitResultFormatter.java>:377:
method does not override a method from its superclass
     [exec]     @Override
     [exec]      ^
     [exec] Note: Some input files use or override a deprecated API.
     [exec] Note: Recompile with -Xlint:deprecation for details.
     [exec] Note: Some input files use unchecked or unsafe operations.
     [exec] Note: Recompile with -Xlint:unchecked for details.
     [exec] 15 errors
     [exec] 
     [exec] BUILD FAILED
     [exec] <https://builds.apache.org/job/Ant-Build-Matrix/./jdk=JDK%201.5%20(latest),label=Windows/ws/trunk\build.xml>:1053:
The following error occurred while executing this line:
     [exec] <https://builds.apache.org/job/Ant-Build-Matrix/./jdk=JDK%201.5%20(latest),label=Windows/ws/trunk\build.xml>:555:
Compile failed; see the compiler error output for details.
     [exec] 
     [exec] Total time: 8 seconds
     [exec] 
     [exec] ... Cleaning Up Build Directories
     [exec] 
     [exec] ... Done Bootstrapping Ant Distribution
     [exec] Bootstrap FAILED

BUILD SUCCESSFUL
Total time: 25 seconds
Recording test results
No test report files were found. Configuration error?
Build step 'Publish JUnit test result report' changed build result to FAILURE

Mime
View raw message