ant-notifications mailing list archives

Site index · List index
Message view « Date » · « Thread »
Top « Date » · « Thread »
From Apache Jenkins Server <jenk...@builds.apache.org>
Subject Build failed in Jenkins: Ant-Build-Matrix » JDK 1.7 (latest),Windows #543
Date Sun, 03 Mar 2013 10:07:34 GMT
See <https://builds.apache.org/job/Ant-Build-Matrix/./jdk=JDK%201.7%20(latest),label=Windows/543/changes>

Changes:

[bodewig] size comparator was vulnerable to integer overflows.  PR 54623

------------------------------------------
[...truncated 3225 lines...]
     [exec] [au:antunit] Target: testDupes took 0.002 sec
     [exec] [au:antunit] Target: testTrimFile took 0.002 sec
     [exec] [au:antunit] Build File: <https://builds.apache.org/job/Ant-Build-Matrix/./jdk=JDK%201.7%20(latest),label=Windows/ws/trunk\src\tests\antunit\taskdefs\loadproperties-test.xml>
     [exec] [au:antunit] Tests run: 11, Failures: 0, Errors: 0, Time elapsed: 0.103 sec
     [exec] [au:antunit] Target: testPrefixedProperties took 0.003 sec
     [exec] [au:antunit] Target: testPropertiesFromFileSet took 0.002 sec
     [exec] [au:antunit] Target: testLineCommentsWithoutFiltering took 0.001 sec
     [exec] [au:antunit] Target: test-xref took 0.002 sec
     [exec] [au:antunit] Target: testLastPropertyWins took 0.001 sec
     [exec] [au:antunit] Target: testPropertiesFromResource took 0.002 sec
     [exec] [au:antunit] Target: testPrefixAttributeProperties took 0 sec
     [exec] [au:antunit] Target: testSelfContainedPrefixFilterFailure took 0.001 sec
     [exec] [au:antunit] Target: testEncoding took 0.037 sec
     [exec] [au:antunit] Target: test-xref-complex took 0.003 sec
     [exec] [au:antunit] Target: test-basic took 0.002 sec
     [exec] [au:antunit] Build File: <https://builds.apache.org/job/Ant-Build-Matrix/./jdk=JDK%201.7%20(latest),label=Windows/ws/trunk\src\tests\antunit\taskdefs\loadresource-test.xml>
     [exec] [au:antunit] Tests run: 2, Failures: 0, Errors: 0, Time elapsed: 0.009 sec
     [exec] [au:antunit] Target: test-resourceString took 0.001 sec
     [exec] [au:antunit] Target: test-resourceSizeZero took 0.001 sec
     [exec] [au:antunit] Build File: <https://builds.apache.org/job/Ant-Build-Matrix/./jdk=JDK%201.7%20(latest),label=Windows/ws/trunk\src\tests\antunit\taskdefs\local-test.xml>
     [exec] [au:antunit] Tests run: 6, Failures: 0, Errors: 0, Time elapsed: 2.043 sec
     [exec] [au:antunit] Target: testMacrodef took 0.003 sec
     [exec] [au:antunit] Target: testSequential took 0.002 sec
     [exec] [au:antunit] Target: testTarget took 0.001 sec
     [exec] [au:antunit] Target: testGlobalLocal took 0 sec
     [exec] [au:antunit] Target: testParallel took 2.011 sec
     [exec] [au:antunit] Target: testBaseline took 0 sec
     [exec] [au:antunit] Build File: <https://builds.apache.org/job/Ant-Build-Matrix/./jdk=JDK%201.7%20(latest),label=Windows/ws/trunk\src\tests\antunit\taskdefs\macrodef-test.xml>
     [exec] [au:antunit] Tests run: 3, Failures: 0, Errors: 0, Time elapsed: 0.014 sec
     [exec] [au:antunit] Target: testEnableDoubleExpandedProperties took 0.001 sec
     [exec] [au:antunit] Target: testDefaultTest took 0.001 sec
     [exec] [au:antunit] Target: testDisableDoubleExpandedProperties took 0.001 sec
     [exec] [au:antunit] Build File: <https://builds.apache.org/job/Ant-Build-Matrix/./jdk=JDK%201.7%20(latest),label=Windows/ws/trunk\src\tests\antunit\taskdefs\manifest-test.xml>
     [exec] [au:antunit] Tests run: 7, Failures: 0, Errors: 0, Time elapsed: 0.056 sec
     [exec] [au:antunit] Target: testMergeClassPathAttributes took 0.006 sec
     [exec] [au:antunit] Target: test8IsAllowed took 0.001 sec
     [exec] [au:antunit] Target: testMergeAndFlattenClassPathAttributes took 0.003 sec
     [exec] [au:antunit] Target: testMergeOverridesClassPath took 0.003 sec
     [exec] [au:antunit] Target: testFlattenMultipleClassPathAttributes took 0.003 sec
     [exec] [au:antunit] Target: testMultipleClassPathAttributes took 0.002 sec
     [exec] [au:antunit] Target: testMergeOverrides took 0.008 sec
     [exec] [au:antunit] Build File: <https://builds.apache.org/job/Ant-Build-Matrix/./jdk=JDK%201.7%20(latest),label=Windows/ws/trunk\src\tests\antunit\taskdefs\move-test.xml>
     [exec] [au:antunit] Tests run: 13, Failures: 1, Errors: 0, Time elapsed: 15.617 sec
     [exec] [au:antunit] Target: testForcedFilteredMoveOverReadOnlyFileWithOverwrite took
0.412 sec
     [exec] [au:antunit] Target: test-move-caseonly took 0.003 sec
     [exec] [au:antunit] Target: testOverwriteIsHonored took 2.003 sec
     [exec] [au:antunit] Target: testMoveOverReadOnlyFile took 2.408 sec
     [exec] [au:antunit] Target: testForcedMoveOverReadOnlyFile took 2.408 sec
     [exec] [au:antunit] Target: testForcedFilteredMoveOverReadOnlyFile took 2.408 sec
     [exec] [au:antunit] Target: testNotModifiedSelector took 0.005 sec
     [exec] [au:antunit] Target: test-regex-mapper took 0.023 sec
     [exec] [au:antunit] Target: testForcedMoveOverReadOnlyFileWithOverwrite took 0.409 sec
     [exec] [au:antunit] Target: testMoveOverReadOnlyFileWithOverwrite took 0.408 sec
     [exec] [au:antunit] Target: testFilteredMoveOverReadOnlyFile took 2.409 sec
     [exec] [au:antunit] Target: testFilteredMoveOverReadOnlyFileWithOverwrite  FAILED
     [exec] [au:antunit] 	at line 186, column 70
     [exec] [au:antunit] 	Message: Expected build failure
     [exec] [au:antunit] 	took 0.646 sec
     [exec] [au:antunit] Target: testOverwriteIsTrueByDefault took 2.003 sec
     [exec] [au:antunit] Build File: <https://builds.apache.org/job/Ant-Build-Matrix/./jdk=JDK%201.7%20(latest),label=Windows/ws/trunk\src\tests\antunit\taskdefs\optional\depend\depend-test.xml>
     [exec] [au:antunit] Tests run: 3, Failures: 0, Errors: 0, Time elapsed: 9.402 sec
     [exec] [au:antunit] Target: testBug45916 took 3.094 sec
     [exec] [au:antunit] Target: testClasspathDir took 3.141 sec
     [exec] [au:antunit] Target: testClasspathJar took 3.149 sec
     [exec] [au:antunit] Build File: <https://builds.apache.org/job/Ant-Build-Matrix/./jdk=JDK%201.7%20(latest),label=Windows/ws/trunk\src\tests\antunit\taskdefs\optional\funtest-test.xml>
     [exec] [au:antunit] Tests run: 4, Failures: 0, Errors: 0, Time elapsed: 10.538 sec
     [exec] [au:antunit] Target: testSetupFailureSkipsTeardown took 10.009 sec
     [exec] [au:antunit] Target: testToSuccess took 0.508 sec
     [exec] [au:antunit] Target: testPresets took 0.001 sec
     [exec] [au:antunit] Target: testCondition took 0 sec
     [exec] [au:antunit] Build File: <https://builds.apache.org/job/Ant-Build-Matrix/./jdk=JDK%201.7%20(latest),label=Windows/ws/trunk\src\tests\antunit\taskdefs\optional\javah-test.xml>
     [exec] [au:antunit] Tests run: 3, Failures: 0, Errors: 0, Time elapsed: 0.156 sec
     [exec] [au:antunit] Target: testImplementationClasspath took 0.051 sec
     [exec] [au:antunit] Target: testAdapterNotFound took 0.041 sec
     [exec] [au:antunit] Target: testImplementationAsNestedElement took 0.045 sec
     [exec] [au:antunit] Build File: <https://builds.apache.org/job/Ant-Build-Matrix/./jdk=JDK%201.7%20(latest),label=Windows/ws/trunk\src\tests\antunit\taskdefs\optional\junit\junit-formatter-test.xml>
     [exec] [au:antunit] Tests run: 4, Failures: 0, Errors: 0, Time elapsed: 1.951 sec
     [exec] [au:antunit] Target: testPropertySet took 0.484 sec
     [exec] [au:antunit] Target: testPropertyNotSet took 0.468 sec
     [exec] [au:antunit] Target: testPropertyFalse took 0.465 sec
     [exec] [au:antunit] Target: testPropertyTrue took 0.476 sec
     [exec] [au:antunit] Build File: <https://builds.apache.org/job/Ant-Build-Matrix/./jdk=JDK%201.7%20(latest),label=Windows/ws/trunk\src\tests\antunit\taskdefs\optional\junit\junit-outputtoformatters-test.xml>
     [exec] [au:antunit] Tests run: 7, Failures: 3, Errors: 0, Time elapsed: 2.013 sec
     [exec] [au:antunit] Target: test-show-yes-formatters-no  FAILED
     [exec] [au:antunit] 	at line 90, column 27
     [exec] [au:antunit] 	Message: Expected log to contain 'Hello From Test' at level info
     [exec] [au:antunit] 	took 0.46 sec
     [exec] [au:antunit] Target: test-show-no-formatters-yes  FAILED
     [exec] [au:antunit] 	at line 119, column 28
     [exec] [au:antunit] 	Message: Assertion failed
     [exec] [au:antunit] 	took 0.482 sec
     [exec] [au:antunit] Target: test-show-no-formatters-no-fork-no took 0.041 sec
     [exec] [au:antunit] Target: test-show-no-formatters-yes-fork-no took 0.037 sec
     [exec] [au:antunit] Target: test-show-yes-formatters-no-forkno took 0.038 sec
     [exec] [au:antunit] Target: test-show-yes-formatters-yes  FAILED
     [exec] [au:antunit] 	at line 83, column 27
     [exec] [au:antunit] 	Message: Expected log to contain 'Hello From Test' at level info
     [exec] [au:antunit] 	took 0.461 sec
     [exec] [au:antunit] Target: test-show-no-formatters-no took 0.458 sec
     [exec] [au:antunit] Build File: <https://builds.apache.org/job/Ant-Build-Matrix/./jdk=JDK%201.7%20(latest),label=Windows/ws/trunk\src\tests\antunit\taskdefs\optional\junit\junit-test.xml>
     [exec] [au:antunit] Tests run: 11, Failures: 4, Errors: 3, Time elapsed: 17.558 sec
     [exec] [au:antunit] Target: testTimeoutAndFormattersForkOnce  FAILED
     [exec] [au:antunit] 	at line 200, column 65
     [exec] [au:antunit] 	Message: Expected file '<https://builds.apache.org/job/Ant-Build-Matrix/./jdk=JDK%201.7%20(latest),label=Windows/ws/trunk\build\antunit\tmp\testoutput/TEST-test.ATest.txt'>
to exist
     [exec] [au:antunit] 	took 0.496 sec
     [exec] [au:antunit] Target: testFailurePropertyOnTestSuite took 0.111 sec
     [exec] [au:antunit] Target: testTestMethods  caused an ERROR
     [exec] [au:antunit] 	at line 332, column 63
     [exec] [au:antunit] 	Message: Test T1 failed (crashed)
     [exec] [au:antunit] 	took 0.452 sec
     [exec] [au:antunit] Target: testTimeoutAndFormattersForkPerTest took 1.796 sec
     [exec] [au:antunit] Target: testPropertiesSet  FAILED
     [exec] [au:antunit] 	at line 268, column 55
     [exec] [au:antunit] 	Message: Expected log to contain 'Running test.BTest' at level info
     [exec] [au:antunit] 	took 1.343 sec
     [exec] [au:antunit] Target: testMissingTestName took 0.002 sec
     [exec] [au:antunit] Target: testPropertiesTrue  caused an ERROR
     [exec] [au:antunit] 	at line 279, column 10
     [exec] [au:antunit] 	Message: The following error occurred while executing this line:
     [exec] [au:antunit] <https://builds.apache.org/job/Ant-Build-Matrix/./jdk=JDK%201.7%20(latest),label=Windows/ws/trunk\src\tests\antunit\taskdefs\optional\junit\junit-test.xml>:220:
Process fork failed.
     [exec] [au:antunit] 	took 0.084 sec
     [exec] [au:antunit] Target: testPropertiesNotSet  caused an ERROR
     [exec] [au:antunit] 	at line 253, column 10
     [exec] [au:antunit] 	Message: The following error occurred while executing this line:
     [exec] [au:antunit] <https://builds.apache.org/job/Ant-Build-Matrix/./jdk=JDK%201.7%20(latest),label=Windows/ws/trunk\src\tests\antunit\taskdefs\optional\junit\junit-test.xml>:220:
Process fork failed.
     [exec] [au:antunit] 	took 0.06 sec
     [exec] [au:antunit] Target: testPropertiesFalse  FAILED
     [exec] [au:antunit] 	at line 294, column 55
     [exec] [au:antunit] 	Message: Expected log to contain 'Running test.BTest' at level info
     [exec] [au:antunit] 	took 12.513 sec
     [exec] [au:antunit] Target: testTimeoutLogOfBatchTests  FAILED
     [exec] [au:antunit] 	at line 77, column 42
     [exec] [au:antunit] 	Message: Expected log to contain 'ATest' at level info
     [exec] [au:antunit] 	took 0.474 sec
     [exec] [au:antunit] Target: testFailurePropertyOnTestCase took 0.035 sec
     [exec] [au:antunit] Build File: <https://builds.apache.org/job/Ant-Build-Matrix/./jdk=JDK%201.7%20(latest),label=Windows/ws/trunk\src\tests\antunit\taskdefs\optional\junit\xmlformatter-test.xml>
     [exec] [au:antunit] Tests run: 3, Failures: 1, Errors: 2, Time elapsed: 0.603 sec
     [exec] [au:antunit] Target: testEntities  FAILED
     [exec] [au:antunit] 	at line 179, column 37
     [exec] [au:antunit] 	Message: Expected resource '<https://builds.apache.org/job/Ant-Build-Matrix/./jdk=JDK%201.7%20(latest),label=Windows/ws/trunk\build\antunit\tmp\testoutput/TEST-org.example.A.xml'>
to contain value 'message="&amp;amp;&amp;' but was '${<https://builds.apache.org/job/Ant-Build-Matrix/./jdk=JDK%201.7%20(latest),label=Windows/ws/trunk\build\antunit\tmp\testoutput/TEST-org.example.A.xml}'>
     [exec] [au:antunit] 	took 0.482 sec
     [exec] [au:antunit] Target: test0Character  caused an ERROR
     [exec] [au:antunit] 	at line 40, column 24
     [exec] [au:antunit] 	Message: Process fork failed.
     [exec] [au:antunit] 	took 0.055 sec
     [exec] [au:antunit] Target: testMessageWithTheWordMore  caused an ERROR
     [exec] [au:antunit] 	at line 108, column 24
     [exec] [au:antunit] 	Message: Process fork failed.
     [exec] [au:antunit] 	took 0.049 sec
     [exec] [au:antunit] Build File: <https://builds.apache.org/job/Ant-Build-Matrix/./jdk=JDK%201.7%20(latest),label=Windows/ws/trunk\src\tests\antunit\taskdefs\optional\native2ascii-test.xml>
     [exec] [au:antunit] Tests run: 3, Failures: 0, Errors: 0, Time elapsed: 0.15 sec
     [exec] [au:antunit] Target: testImplementationClasspath took 0.052 sec
     [exec] [au:antunit] Target: testAdapterNotFound took 0.041 sec
     [exec] [au:antunit] Target: testImplementationAsNestedElement took 0.042 sec
     [exec] [au:antunit] Build File: <https://builds.apache.org/job/Ant-Build-Matrix/./jdk=JDK%201.7%20(latest),label=Windows/ws/trunk\src\tests\antunit\taskdefs\optional\propertyfile-test.xml>
     [exec] [au:antunit] Tests run: 1, Failures: 0, Errors: 0, Time elapsed: 0.031 sec
     [exec] [au:antunit] Target: testReadWithPrefix took 0.027 sec
     [exec] [au:antunit] Build File: <https://builds.apache.org/job/Ant-Build-Matrix/./jdk=JDK%201.7%20(latest),label=Windows/ws/trunk\src\tests\antunit\taskdefs\optional\propertyfilelayout-test.xml>
     [exec] [au:antunit] Tests run: 10, Failures: 0, Errors: 0, Time elapsed: 0.168 sec
     [exec] [au:antunit] Target: testPreservesUnixLineEnds took 0.025 sec
     [exec] [au:antunit] Target: testCreateWithoutComment took 0.008 sec
     [exec] [au:antunit] Target: testUpdateWithoutComment took 0.006 sec
     [exec] [au:antunit] Target: testUpdateWithNewComment took 0.007 sec
     [exec] [au:antunit] Target: testPreservesDosLineEnds took 0.008 sec
     [exec] [au:antunit] Target: testRepeatedUpdateWithSameComment took 0.029 sec
     [exec] [au:antunit] Target: testCreateWithComment took 0.007 sec
     [exec] [au:antunit] Target: testPreservesMacLineEnds took 0.009 sec
     [exec] [au:antunit] Target: testUpdateWithSameComment took 0.006 sec
     [exec] [au:antunit] Target: testRepeatedUpdateWithoutComment took 0.009 sec
     [exec] [au:antunit] Build File: <https://builds.apache.org/job/Ant-Build-Matrix/./jdk=JDK%201.7%20(latest),label=Windows/ws/trunk\src\tests\antunit\taskdefs\optional\replaceregexp-test.xml>
     [exec] [au:antunit] Tests run: 1, Failures: 0, Errors: 0, Time elapsed: 0.031 sec
     [exec] [au:antunit] Target: testRCSupport took 0.019 sec
     [exec] [au:antunit] Build File: <https://builds.apache.org/job/Ant-Build-Matrix/./jdk=JDK%201.7%20(latest),label=Windows/ws/trunk\src\tests\antunit\taskdefs\optional\script\scriptdef-test.xml>
     [exec] 
     [exec] [error occurred during error reporting (null), id 0xc0000005]
     [exec] 
     [exec] #
     [exec] # There is insufficient memory for the Java Runtime Environment to continue.
     [exec] # Native memory allocation (malloc) failed to allocate 1132896 bytes for Chunk::new
     [exec] # An error report file with more information is saved as:
     [exec] # <https://builds.apache.org/job/Ant-Build-Matrix/./jdk=JDK%201.7%20(latest),label=Windows/ws/trunk\hs_err_pid1528.log>

BUILD SUCCESSFUL
Total time: 2 minutes 48 seconds
Recording test results
ERROR: Failed to archive test reports
hudson.util.IOException2: remote file operation failed: <https://builds.apache.org/job/Ant-Build-Matrix/./jdk=JDK%201.7%20(latest),label=Windows/ws/>
at hudson.remoting.Channel@7bb37db5:windows1
	at hudson.FilePath.act(FilePath.java:861)
	at hudson.FilePath.act(FilePath.java:838)
	at hudson.tasks.junit.JUnitParser.parse(JUnitParser.java:87)
	at hudson.tasks.junit.JUnitResultArchiver.parse(JUnitResultArchiver.java:122)
	at hudson.tasks.junit.JUnitResultArchiver.perform(JUnitResultArchiver.java:134)
	at hudson.tasks.BuildStepMonitor$1.perform(BuildStepMonitor.java:19)
	at hudson.model.AbstractBuild$AbstractBuildExecution.perform(AbstractBuild.java:810)
	at hudson.model.AbstractBuild$AbstractBuildExecution.performAllBuildSteps(AbstractBuild.java:785)
	at hudson.model.Build$BuildExecution.post2(Build.java:183)
	at hudson.model.AbstractBuild$AbstractBuildExecution.post(AbstractBuild.java:732)
	at hudson.model.Run.execute(Run.java:1593)
	at hudson.matrix.MatrixRun.run(MatrixRun.java:146)
	at hudson.model.ResourceController.execute(ResourceController.java:88)
	at hudson.model.Executor.run(Executor.java:236)
Caused by: hudson.util.IOException2: Failed to read <https://builds.apache.org/job/Ant-Build-Matrix/./jdk=JDK%201.7%20(latest),label=Windows/ws/trunk\build\antunit\xml\TEST-src.tests.antunit.taskdefs.optional.script.scriptdef-test_xml.xml>
	at hudson.tasks.junit.TestResult.parse(TestResult.java:284)
	at hudson.tasks.junit.TestResult.parsePossiblyEmpty(TestResult.java:223)
	at hudson.tasks.junit.TestResult.parse(TestResult.java:158)
	at hudson.tasks.junit.TestResult.parse(TestResult.java:141)
	at hudson.tasks.junit.TestResult.<init>(TestResult.java:117)
	at hudson.tasks.junit.JUnitParser$ParseResultCallable.invoke(JUnitParser.java:117)
	at hudson.tasks.junit.JUnitParser$ParseResultCallable.invoke(JUnitParser.java:90)
	at hudson.FilePath$FileCallableWrapper.call(FilePath.java:2348)
	at hudson.remoting.UserRequest.perform(UserRequest.java:118)
	at hudson.remoting.UserRequest.perform(UserRequest.java:48)
	at hudson.remoting.Request$2.run(Request.java:326)
	at hudson.remoting.InterceptingExecutorService$1.call(InterceptingExecutorService.java:72)
	at java.util.concurrent.FutureTask$Sync.innerRun(Unknown Source)
	at java.util.concurrent.FutureTask.run(Unknown Source)
	at java.util.concurrent.ThreadPoolExecutor.runWorker(Unknown Source)
	at java.util.concurrent.ThreadPoolExecutor$Worker.run(Unknown Source)
	at hudson.remoting.Engine$1$1.run(Engine.java:58)
	at java.lang.Thread.run(Unknown Source)
Caused by: org.dom4j.DocumentException: Error on line 85 of document file:///f:/hudson/hudson-slave/workspace/Ant-Build-Matrix/jdk/JDK%201.7%20(latest)/label/Windows/trunk/build/antunit/xml/TEST-src.tests.antunit.taskdefs.optional.script.scriptdef-test_xml.xml
: XML document structures must start and end within the same entity. Nested exception: XML
document structures must start and end within the same entity.
	at org.dom4j.io.SAXReader.read(SAXReader.java:482)
	at org.dom4j.io.SAXReader.read(SAXReader.java:264)
	at hudson.tasks.junit.SuiteResult.parse(SuiteResult.java:129)
	at hudson.tasks.junit.TestResult.parse(TestResult.java:267)
	... 17 more
Caused by: org.xml.sax.SAXParseException; systemId: file:///f:/hudson/hudson-slave/workspace/Ant-Build-Matrix/jdk/JDK%201.7%20(latest)/label/Windows/trunk/build/antunit/xml/TEST-src.tests.antunit.taskdefs.optional.script.scriptdef-test_xml.xml;
lineNumber: 85; columnNumber: 1; XML document structures must start and end within the same
entity.
	at com.sun.org.apache.xerces.internal.util.ErrorHandlerWrapper.createSAXParseException(Unknown
Source)
	at com.sun.org.apache.xerces.internal.util.ErrorHandlerWrapper.fatalError(Unknown Source)
	at com.sun.org.apache.xerces.internal.impl.XMLErrorReporter.reportError(Unknown Source)
	at com.sun.org.apache.xerces.internal.impl.XMLErrorReporter.reportError(Unknown Source)
	at com.sun.org.apache.xerces.internal.impl.XMLScanner.reportFatalError(Unknown Source)
	at com.sun.org.apache.xerces.internal.impl.XMLDocumentFragmentScannerImpl.endEntity(Unknown
Source)
	at com.sun.org.apache.xerces.internal.impl.XMLDocumentScannerImpl.endEntity(Unknown Source)
	at com.sun.org.apache.xerces.internal.impl.XMLEntityManager.endEntity(Unknown Source)
	at com.sun.org.apache.xerces.internal.impl.XMLEntityScanner.load(Unknown Source)
	at com.sun.org.apache.xerces.internal.impl.XMLEntityScanner.skipChar(Unknown Source)
	at com.sun.org.apache.xerces.internal.impl.XMLDocumentFragmentScannerImpl$FragmentContentDriver.next(Unknown
Source)
	at com.sun.org.apache.xerces.internal.impl.XMLDocumentScannerImpl.next(Unknown Source)
	at com.sun.org.apache.xerces.internal.impl.XMLNSDocumentScannerImpl.next(Unknown Source)
	at com.sun.org.apache.xerces.internal.impl.XMLDocumentFragmentScannerImpl.scanDocument(Unknown
Source)
	at com.sun.org.apache.xerces.internal.parsers.XML11Configuration.parse(Unknown Source)
	at com.sun.org.apache.xerces.internal.parsers.XML11Configuration.parse(Unknown Source)
	at com.sun.org.apache.xerces.internal.parsers.XMLParser.parse(Unknown Source)
	at com.sun.org.apache.xerces.internal.parsers.AbstractSAXParser.parse(Unknown Source)
	at com.sun.org.apache.xerces.internal.jaxp.SAXParserImpl$JAXPSAXParser.parse(Unknown Source)
	at org.dom4j.io.SAXReader.read(SAXReader.java:465)
	... 20 more
Build step 'Publish JUnit test result report' changed build result to FAILURE

Mime
View raw message