ant-notifications mailing list archives

Site index · List index
Message view « Date » · « Thread »
Top « Date » · « Thread »
From Apache Jenkins Server <jenk...@builds.apache.org>
Subject Build failed in Jenkins: Ivy-tests » JDK 1.5 (latest),Windows #53
Date Tue, 05 Mar 2013 23:20:13 GMT
See <https://builds.apache.org/job/Ivy-tests/./jdk=JDK%201.5%20(latest),label=Windows/53/changes>

Changes:

[maartenc] Attempt to improve HTTP upload speed (IVY-1197)

------------------------------------------
[...truncated 2216 lines...]
    [junit] 	at org.apache.tools.ant.Target.execute(Target.java:357)
    [junit] 	at org.apache.tools.ant.Target.performTasks(Target.java:385)
    [junit] 	at org.apache.tools.ant.Project.executeSortedTargets(Project.java:1329)
    [junit] 	at org.apache.tools.ant.Project.executeTarget(Project.java:1298)
    [junit] 	at org.apache.tools.ant.helper.DefaultExecutor.executeTargets(DefaultExecutor.java:41)
    [junit] 	at org.apache.tools.ant.Project.executeTargets(Project.java:1181)
    [junit] 	at org.apache.tools.ant.Main.runBuild(Main.java:698)
    [junit] 	at org.apache.tools.ant.Main.startAnt(Main.java:199)
    [junit] 	at org.apache.tools.ant.launch.Launcher.run(Launcher.java:257)
    [junit] 	at org.apache.tools.ant.launch.Launcher.main(Launcher.java:104)
    [junit] Running org.apache.ivy.plugins.matcher.ExactPatternMatcherTest
    [junit] Tests run: 1, Failures: 0, Errors: 1, Time elapsed: 0 sec
    [junit] Test org.apache.ivy.plugins.matcher.ExactPatternMatcherTest FAILED (crashed)
    [junit] 
    [junit] Exception 
    [junit] java.io.FileNotFoundException: <https://builds.apache.org/job/Ivy-tests/./jdk=JDK%201.5%20(latest),label=Windows/ws/trunk\junitvmwatcher2032741712.properties>
(The system cannot find the file specified)
    [junit] 	at java.io.FileInputStream.open(Native Method)
    [junit] 	at java.io.FileInputStream.<init>(FileInputStream.java:106)
    [junit] 	at java.io.FileReader.<init>(FileReader.java:55)
    [junit] 	at org.apache.tools.ant.taskdefs.optional.junit.JUnitTask.executeAsForked(JUnitTask.java:1028)
    [junit] 	at org.apache.tools.ant.taskdefs.optional.junit.JUnitTask.execute(JUnitTask.java:817)
    [junit] 	at org.apache.tools.ant.taskdefs.optional.junit.JUnitTask.executeOrQueue(JUnitTask.java:1657)
    [junit] 	at org.apache.tools.ant.taskdefs.optional.junit.JUnitTask.execute(JUnitTask.java:764)
    [junit] 	at org.apache.tools.ant.UnknownElement.execute(UnknownElement.java:288)
    [junit] 	at sun.reflect.GeneratedMethodAccessor2.invoke(Unknown Source)
    [junit] 	at sun.reflect.DelegatingMethodAccessorImpl.invoke(DelegatingMethodAccessorImpl.java:25)
    [junit] 	at java.lang.reflect.Method.invoke(Method.java:592)
    [junit] 	at org.apache.tools.ant.dispatch.DispatchUtils.execute(DispatchUtils.java:105)
    [junit] 	at org.apache.tools.ant.Task.perform(Task.java:348)
    [junit] 	at org.apache.tools.ant.Target.execute(Target.java:357)
    [junit] 	at org.apache.tools.ant.Target.performTasks(Target.java:385)
    [junit] 	at org.apache.tools.ant.Project.executeSortedTargets(Project.java:1329)
    [junit] 	at org.apache.tools.ant.Project.executeTarget(Project.java:1298)
    [junit] 	at org.apache.tools.ant.helper.DefaultExecutor.executeTargets(DefaultExecutor.java:41)
    [junit] 	at org.apache.tools.ant.Project.executeTargets(Project.java:1181)
    [junit] 	at org.apache.tools.ant.Main.runBuild(Main.java:698)
    [junit] 	at org.apache.tools.ant.Main.startAnt(Main.java:199)
    [junit] 	at org.apache.tools.ant.launch.Launcher.run(Launcher.java:257)
    [junit] 	at org.apache.tools.ant.launch.Launcher.main(Launcher.java:104)
    [junit] Running org.apache.ivy.plugins.matcher.GlobPatternMatcherTest
    [junit] Tests run: 1, Failures: 0, Errors: 1, Time elapsed: 0 sec
    [junit] Test org.apache.ivy.plugins.matcher.GlobPatternMatcherTest FAILED (crashed)
    [junit] 
    [junit] Exception in thread "CompilerThread1" java.lang.OutOfMemoryError: requested 32744
bytes for ChunkPool::allocate. Out of swap space?
    [junit] java.io.FileNotFoundException: <https://builds.apache.org/job/Ivy-tests/./jdk=JDK%201.5%20(latest),label=Windows/ws/trunk\junitvmwatcher1981741226.properties>
(The system cannot find the file specified)
    [junit] 	at java.io.FileInputStream.open(Native Method)
    [junit] 	at java.io.FileInputStream.<init>(FileInputStream.java:106)
    [junit] 	at java.io.FileReader.<init>(FileReader.java:55)
    [junit] 	at org.apache.tools.ant.taskdefs.optional.junit.JUnitTask.executeAsForked(JUnitTask.java:1028)
    [junit] 	at org.apache.tools.ant.taskdefs.optional.junit.JUnitTask.execute(JUnitTask.java:817)
    [junit] 	at org.apache.tools.ant.taskdefs.optional.junit.JUnitTask.executeOrQueue(JUnitTask.java:1657)
    [junit] 	at org.apache.tools.ant.taskdefs.optional.junit.JUnitTask.execute(JUnitTask.java:764)
    [junit] 	at org.apache.tools.ant.UnknownElement.execute(UnknownElement.java:288)
    [junit] 	at sun.reflect.GeneratedMethodAccessor2.invoke(Unknown Source)
    [junit] 	at sun.reflect.DelegatingMethodAccessorImpl.invoke(DelegatingMethodAccessorImpl.java:25)
    [junit] 	at java.lang.reflect.Method.invoke(Method.java:592)
    [junit] 	at org.apache.tools.ant.dispatch.DispatchUtils.execute(DispatchUtils.java:105)
    [junit] 	at org.apache.tools.ant.Task.perform(Task.java:348)
    [junit] 	at org.apache.tools.ant.Target.execute(Target.java:357)
    [junit] 	at org.apache.tools.ant.Target.performTasks(Target.java:385)
    [junit] 	at org.apache.tools.ant.Project.executeSortedTargets(Project.java:1329)
    [junit] 	at org.apache.tools.ant.Project.executeTarget(Project.java:1298)
    [junit] 	at org.apache.tools.ant.helper.DefaultExecutor.executeTargets(DefaultExecutor.java:41)
    [junit] 	at org.apache.tools.ant.Project.executeTargets(Project.java:1181)
    [junit] 	at org.apache.tools.ant.Main.runBuild(Main.java:698)
    [junit] 	at org.apache.tools.ant.Main.startAnt(Main.java:199)
    [junit] 	at org.apache.tools.ant.launch.Launcher.run(Launcher.java:257)
    [junit] 	at org.apache.tools.ant.launch.Launcher.main(Launcher.java:104)
    [junit] Running org.apache.ivy.plugins.matcher.RegexpPatternMatcherTest
    [junit] Tests run: 1, Failures: 0, Errors: 1, Time elapsed: 0 sec
    [junit] Test org.apache.ivy.plugins.matcher.RegexpPatternMatcherTest FAILED (crashed)
    [junit] 
    [junit] Exception in thread "CompilerThread1" java.lang.OutOfMemoryError: requested 32744
bytes for ChunkPool::allocate. Out of swap space?
    [junit] java.io.FileNotFoundException: <https://builds.apache.org/job/Ivy-tests/./jdk=JDK%201.5%20(latest),label=Windows/ws/trunk\junitvmwatcher1440211470.properties>
(The system cannot find the file specified)
    [junit] 	at java.io.FileInputStream.open(Native Method)
    [junit] 	at java.io.FileInputStream.<init>(FileInputStream.java:106)
    [junit] 	at java.io.FileReader.<init>(FileReader.java:55)
    [junit] 	at org.apache.tools.ant.taskdefs.optional.junit.JUnitTask.executeAsForked(JUnitTask.java:1028)
    [junit] 	at org.apache.tools.ant.taskdefs.optional.junit.JUnitTask.execute(JUnitTask.java:817)
    [junit] 	at org.apache.tools.ant.taskdefs.optional.junit.JUnitTask.executeOrQueue(JUnitTask.java:1657)
    [junit] 	at org.apache.tools.ant.taskdefs.optional.junit.JUnitTask.execute(JUnitTask.java:764)
    [junit] 	at org.apache.tools.ant.UnknownElement.execute(UnknownElement.java:288)
    [junit] 	at sun.reflect.GeneratedMethodAccessor2.invoke(Unknown Source)
    [junit] 	at sun.reflect.DelegatingMethodAccessorImpl.invoke(DelegatingMethodAccessorImpl.java:25)
    [junit] 	at java.lang.reflect.Method.invoke(Method.java:592)
    [junit] 	at org.apache.tools.ant.dispatch.DispatchUtils.execute(DispatchUtils.java:105)
    [junit] 	at org.apache.tools.ant.Task.perform(Task.java:348)
    [junit] 	at org.apache.tools.ant.Target.execute(Target.java:357)
    [junit] 	at org.apache.tools.ant.Target.performTasks(Target.java:385)
    [junit] 	at org.apache.tools.ant.Project.executeSortedTargets(Project.java:1329)
    [junit] 	at org.apache.tools.ant.Project.executeTarget(Project.java:1298)
    [junit] 	at org.apache.tools.ant.helper.DefaultExecutor.executeTargets(DefaultExecutor.java:41)
    [junit] 	at org.apache.tools.ant.Project.executeTargets(Project.java:1181)
    [junit] 	at org.apache.tools.ant.Main.runBuild(Main.java:698)
    [junit] 	at org.apache.tools.ant.Main.startAnt(Main.java:199)
    [junit] 	at org.apache.tools.ant.launch.Launcher.run(Launcher.java:257)
    [junit] 	at org.apache.tools.ant.launch.Launcher.main(Launcher.java:104)
    [junit] Running org.apache.ivy.plugins.namespace.MRIDTransformationRuleTest
    [junit] Tests run: 1, Failures: 0, Errors: 1, Time elapsed: 0 sec
    [junit] Test org.apache.ivy.plugins.namespace.MRIDTransformationRuleTest FAILED (crashed)
    [junit] 
    [junit] Exception in thread "main" java.lang.OutOfMemoryError: requested 32744 bytes for
ChunkPool::allocate. Out of swap space?
    [junit] java.io.FileNotFoundException: <https://builds.apache.org/job/Ivy-tests/./jdk=JDK%201.5%20(latest),label=Windows/ws/trunk\junitvmwatcher1986856980.properties>
(The system cannot find the file specified)
    [junit] 	at java.io.FileInputStream.open(Native Method)
    [junit] 	at java.io.FileInputStream.<init>(FileInputStream.java:106)
    [junit] 	at java.io.FileReader.<init>(FileReader.java:55)
    [junit] 	at org.apache.tools.ant.taskdefs.optional.junit.JUnitTask.executeAsForked(JUnitTask.java:1028)
    [junit] 	at org.apache.tools.ant.taskdefs.optional.junit.JUnitTask.execute(JUnitTask.java:817)
    [junit] 	at org.apache.tools.ant.taskdefs.optional.junit.JUnitTask.executeOrQueue(JUnitTask.java:1657)
    [junit] 	at org.apache.tools.ant.taskdefs.optional.junit.JUnitTask.execute(JUnitTask.java:764)
    [junit] 	at org.apache.tools.ant.UnknownElement.execute(UnknownElement.java:288)
    [junit] 	at sun.reflect.GeneratedMethodAccessor2.invoke(Unknown Source)
    [junit] 	at sun.reflect.DelegatingMethodAccessorImpl.invoke(DelegatingMethodAccessorImpl.java:25)
    [junit] 	at java.lang.reflect.Method.invoke(Method.java:592)
    [junit] 	at org.apache.tools.ant.dispatch.DispatchUtils.execute(DispatchUtils.java:105)
    [junit] 	at org.apache.tools.ant.Task.perform(Task.java:348)
    [junit] 	at org.apache.tools.ant.Target.execute(Target.java:357)
    [junit] 	at org.apache.tools.ant.Target.performTasks(Target.java:385)
    [junit] 	at org.apache.tools.ant.Project.executeSortedTargets(Project.java:1329)
    [junit] 	at org.apache.tools.ant.Project.executeTarget(Project.java:1298)
    [junit] 	at org.apache.tools.ant.helper.DefaultExecutor.executeTargets(DefaultExecutor.java:41)
    [junit] 	at org.apache.tools.ant.Project.executeTargets(Project.java:1181)
    [junit] 	at org.apache.tools.ant.Main.runBuild(Main.java:698)
    [junit] 	at org.apache.tools.ant.Main.startAnt(Main.java:199)
    [junit] 	at org.apache.tools.ant.launch.Launcher.run(Launcher.java:257)
    [junit] 	at org.apache.tools.ant.launch.Launcher.main(Launcher.java:104)
    [junit] Running org.apache.ivy.plugins.namespace.NameSpaceHelperTest
    [junit] Tests run: 1, Failures: 0, Errors: 1, Time elapsed: 0 sec
    [junit] Test org.apache.ivy.plugins.namespace.NameSpaceHelperTest FAILED (crashed)
    [junit] 
    [junit] Exception in thread "CompilerThread0" java.lang.OutOfMemoryError: requested 32744
bytes for ChunkPool::allocate. Out of swap space?
    [junit] java.io.FileNotFoundException: <https://builds.apache.org/job/Ivy-tests/./jdk=JDK%201.5%20(latest),label=Windows/ws/trunk\junitvmwatcher2136624082.properties>
(The system cannot find the file specified)
    [junit] 	at java.io.FileInputStream.open(Native Method)
    [junit] 	at java.io.FileInputStream.<init>(FileInputStream.java:106)
    [junit] 	at java.io.FileReader.<init>(FileReader.java:55)
    [junit] 	at org.apache.tools.ant.taskdefs.optional.junit.JUnitTask.executeAsForked(JUnitTask.java:1028)
    [junit] 	at org.apache.tools.ant.taskdefs.optional.junit.JUnitTask.execute(JUnitTask.java:817)
    [junit] 	at org.apache.tools.ant.taskdefs.optional.junit.JUnitTask.executeOrQueue(JUnitTask.java:1657)
    [junit] 	at org.apache.tools.ant.taskdefs.optional.junit.JUnitTask.execute(JUnitTask.java:764)
    [junit] 	at org.apache.tools.ant.UnknownElement.execute(UnknownElement.java:288)
    [junit] 	at sun.reflect.GeneratedMethodAccessor2.invoke(Unknown Source)
    [junit] 	at sun.reflect.DelegatingMethodAccessorImpl.invoke(DelegatingMethodAccessorImpl.java:25)
    [junit] 	at java.lang.reflect.Method.invoke(Method.java:592)
    [junit] 	at org.apache.tools.ant.dispatch.DispatchUtils.execute(DispatchUtils.java:105)
    [junit] 	at org.apache.tools.ant.Task.perform(Task.java:348)
    [junit] 	at org.apache.tools.ant.Target.execute(Target.java:357)
    [junit] 	at org.apache.tools.ant.Target.performTasks(Target.java:385)
    [junit] 	at org.apache.tools.ant.Project.executeSortedTargets(Project.java:1329)
    [junit] 	at org.apache.tools.ant.Project.executeTarget(Project.java:1298)
    [junit] 	at org.apache.tools.ant.helper.DefaultExecutor.executeTargets(DefaultExecutor.java:41)
    [junit] 	at org.apache.tools.ant.Project.executeTargets(Project.java:1181)
    [junit] 	at org.apache.tools.ant.Main.runBuild(Main.java:698)
    [junit] 	at org.apache.tools.ant.Main.startAnt(Main.java:199)
    [junit] 	at org.apache.tools.ant.launch.Launcher.run(Launcher.java:257)
    [junit] 	at org.apache.tools.ant.launch.Launcher.main(Launcher.java:104)
    [junit] Running org.apache.ivy.plugins.parser.ModuleDescriptorParserRegistryTest
    [junit] Tests run: 1, Failures: 0, Errors: 1, Time elapsed: 0 sec
    [junit] Test org.apache.ivy.plugins.parser.ModuleDescriptorParserRegistryTest FAILED (crashed)
    [junit] 
    [junit] Exception in thread "CompilerThread1" java.lang.OutOfMemoryError: requested 32744
bytes for ChunkPool::allocate. Out of swap space?
    [junit] java.io.FileNotFoundException: <https://builds.apache.org/job/Ivy-tests/./jdk=JDK%201.5%20(latest),label=Windows/ws/trunk\junitvmwatcher637764382.properties>
(The system cannot find the file specified)
    [junit] 	at java.io.FileInputStream.open(Native Method)
    [junit] 	at java.io.FileInputStream.<init>(FileInputStream.java:106)
    [junit] 	at java.io.FileReader.<init>(FileReader.java:55)
    [junit] 	at org.apache.tools.ant.taskdefs.optional.junit.JUnitTask.executeAsForked(JUnitTask.java:1028)
    [junit] 	at org.apache.tools.ant.taskdefs.optional.junit.JUnitTask.execute(JUnitTask.java:817)
    [junit] 	at org.apache.tools.ant.taskdefs.optional.junit.JUnitTask.executeOrQueue(JUnitTask.java:1657)
    [junit] 	at org.apache.tools.ant.taskdefs.optional.junit.JUnitTask.execute(JUnitTask.java:764)
    [junit] 	at org.apache.tools.ant.UnknownElement.execute(UnknownElement.java:288)
    [junit] 	at sun.reflect.GeneratedMethodAccessor2.invoke(Unknown Source)
    [junit] 	at sun.reflect.DelegatingMethodAccessorImpl.invoke(DelegatingMethodAccessorImpl.java:25)
    [junit] 	at java.lang.reflect.Method.invoke(Method.java:592)
    [junit] 	at org.apache.tools.ant.dispatch.DispatchUtils.execute(DispatchUtils.java:105)
    [junit] 	at org.apache.tools.ant.Task.perform(Task.java:348)
    [junit] 	at org.apache.tools.ant.Target.execute(Target.java:357)
    [junit] 	at org.apache.tools.ant.Target.performTasks(Target.java:385)
    [junit] 	at org.apache.tools.ant.Project.executeSortedTargets(Project.java:1329)
    [junit] 	at org.apache.tools.ant.Project.executeTarget(Project.java:1298)
    [junit] 	at org.apache.tools.ant.helper.DefaultExecutor.executeTargets(DefaultExecutor.java:41)
    [junit] 	at org.apache.tools.ant.Project.executeTargets(Project.java:1181)
    [junit] 	at org.apache.tools.ant.Main.runBuild(Main.java:698)
    [junit] 	at org.apache.tools.ant.Main.startAnt(Main.java:199)
    [junit] 	at org.apache.tools.ant.launch.Launcher.run(Launcher.java:257)
    [junit] 	at org.apache.tools.ant.launch.Launcher.main(Launcher.java:104)
    [junit] Running org.apache.ivy.plugins.parser.m2.PomModuleDescriptorParserTest
    [junit] Tests run: 1, Failures: 0, Errors: 1, Time elapsed: 0 sec
    [junit] Test org.apache.ivy.plugins.parser.m2.PomModuleDescriptorParserTest FAILED (crashed)
    [junit] 
    [junit] Exception in thread "CompilerThread0" java.lang.OutOfMemoryError: requested 77376
bytes for Chunk::new. Out of swap space?
    [junit] java.io.FileNotFoundException: <https://builds.apache.org/job/Ivy-tests/./jdk=JDK%201.5%20(latest),label=Windows/ws/trunk\junitvmwatcher184433188.properties>
(The system cannot find the file specified)
    [junit] 	at java.io.FileInputStream.open(Native Method)
    [junit] 	at java.io.FileInputStream.<init>(FileInputStream.java:106)
    [junit] 	at java.io.FileReader.<init>(FileReader.java:55)
    [junit] 	at org.apache.tools.ant.taskdefs.optional.junit.JUnitTask.executeAsForked(JUnitTask.java:1028)
    [junit] 	at org.apache.tools.ant.taskdefs.optional.junit.JUnitTask.execute(JUnitTask.java:817)
    [junit] 	at org.apache.tools.ant.taskdefs.optional.junit.JUnitTask.executeOrQueue(JUnitTask.java:1657)
    [junit] 	at org.apache.tools.ant.taskdefs.optional.junit.JUnitTask.execute(JUnitTask.java:764)
    [junit] 	at org.apache.tools.ant.UnknownElement.execute(UnknownElement.java:288)
    [junit] 	at sun.reflect.GeneratedMethodAccessor2.invoke(Unknown Source)
    [junit] 	at sun.reflect.DelegatingMethodAccessorImpl.invoke(DelegatingMethodAccessorImpl.java:25)
    [junit] 	at java.lang.reflect.Method.invoke(Method.java:592)
    [junit] 	at org.apache.tools.ant.dispatch.DispatchUtils.execute(DispatchUtils.java:105)
    [junit] 	at org.apache.tools.ant.Task.perform(Task.java:348)
    [junit] 	at org.apache.tools.ant.Target.execute(Target.java:357)
    [junit] 	at org.apache.tools.ant.Target.performTasks(Target.java:385)
    [junit] 	at org.apache.tools.ant.Project.executeSortedTargets(Project.java:1329)
    [junit] 	at org.apache.tools.ant.Project.executeTarget(Project.java:1298)
    [junit] 	at org.apache.tools.ant.helper.DefaultExecutor.executeTargets(DefaultExecutor.java:41)
    [junit] 	at org.apache.tools.ant.Project.executeTargets(Project.java:1181)
    [junit] 	at org.apache.tools.ant.Main.runBuild(Main.java:698)
    [junit] 	at org.apache.tools.ant.Main.startAnt(Main.java:199)
    [junit] 	at org.apache.tools.ant.launch.Launcher.run(Launcher.java:257)
    [junit] 	at org.apache.tools.ant.launch.Launcher.main(Launcher.java:104)
    [junit] Running org.apache.ivy.plugins.parser.m2.PomModuleDescriptorWriterTest
    [junit] Tests run: 1, Failures: 0, Errors: 1, Time elapsed: 0 sec
    [junit] Test org.apache.ivy.plugins.parser.m2.PomModuleDescriptorWriterTest FAILED (crashed)
    [junit] 
    [junit] Exception in thread "CompilerThread1" java.lang.OutOfMemoryError: requested 77376
bytes for Chunk::new. Out of swap space?
    [junit] java.io.FileNotFoundException: <https://builds.apache.org/job/Ivy-tests/./jdk=JDK%201.5%20(latest),label=Windows/ws/trunk\junitvmwatcher1172394525.properties>
(The system cannot find the file specified)
    [junit] 	at java.io.FileInputStream.open(Native Method)
    [junit] 	at java.io.FileInputStream.<init>(FileInputStream.java:106)
    [junit] 	at java.io.FileReader.<init>(FileReader.java:55)
    [junit] 	at org.apache.tools.ant.taskdefs.optional.junit.JUnitTask.executeAsForked(JUnitTask.java:1028)
    [junit] 	at org.apache.tools.ant.taskdefs.optional.junit.JUnitTask.execute(JUnitTask.java:817)
    [junit] 	at org.apache.tools.ant.taskdefs.optional.junit.JUnitTask.executeOrQueue(JUnitTask.java:1657)
    [junit] 	at org.apache.tools.ant.taskdefs.optional.junit.JUnitTask.execute(JUnitTask.java:764)
    [junit] 	at org.apache.tools.ant.UnknownElement.execute(UnknownElement.java:288)
    [junit] 	at sun.reflect.GeneratedMethodAccessor2.invoke(Unknown Source)
    [junit] 	at sun.reflect.DelegatingMethodAccessorImpl.invoke(DelegatingMethodAccessorImpl.java:25)
    [junit] 	at java.lang.reflect.Method.invoke(Method.java:592)
    [junit] 	at org.apache.tools.ant.dispatch.DispatchUtils.execute(DispatchUtils.java:105)
    [junit] 	at org.apache.tools.ant.Task.perform(Task.java:348)
    [junit] 	at org.apache.tools.ant.Target.execute(Target.java:357)
    [junit] 	at org.apache.tools.ant.Target.performTasks(Target.java:385)
    [junit] 	at org.apache.tools.ant.Project.executeSortedTargets(Project.java:1329)
    [junit] 	at org.apache.tools.ant.Project.executeTarget(Project.java:1298)
    [junit] 	at org.apache.tools.ant.helper.DefaultExecutor.executeTargets(DefaultExecutor.java:41)
    [junit] 	at org.apache.tools.ant.Project.executeTargets(Project.java:1181)
    [junit] 	at org.apache.tools.ant.Main.runBuild(Main.java:698)
    [junit] 	at org.apache.tools.ant.Main.startAnt(Main.java:199)
    [junit] 	at org.apache.tools.ant.launch.Launcher.run(Launcher.java:257)
    [junit] 	at org.apache.tools.ant.launch.Launcher.main(Launcher.java:104)
    [junit] Running org.apache.ivy.plugins.parser.xml.XmlModuleDescriptorParserTest
    [junit] Tests run: 1, Failures: 0, Errors: 1, Time elapsed: 0 sec
    [junit] Test org.apache.ivy.plugins.parser.xml.XmlModuleDescriptorParserTest FAILED (crashed)

Exception in thread "CompilerThread0" java.lang.OutOfMemoryError: requested 957536 bytes for
Chunk::new. Out of swap space?
Build step 'Invoke Ant' marked build as failure
Recording test results

Mime
View raw message