ant-notifications mailing list archives

Site index · List index
Message view « Date » · « Thread »
Top « Date » · « Thread »
From Apache Jenkins Server <jenk...@builds.apache.org>
Subject Build failed in Jenkins: Ivy-tests » JDK 1.5 (latest),Ubuntu #39
Date Wed, 28 Nov 2012 18:09:36 GMT
See <https://builds.apache.org/job/Ivy-tests/./jdk=JDK%201.5%20(latest),label=Ubuntu/39/changes>

Changes:

[hibou] Properly handle evicted nodes

------------------------------------------
[...truncated 3296 lines...]
    [junit] Running org.apache.ivy.IvyTest
    [junit] Tests run: 1, Failures: 0, Errors: 0, Time elapsed: 0,685 sec
    [junit] Running org.apache.ivy.MainTest
    [junit] Tests run: 9, Failures: 0, Errors: 0, Time elapsed: 0,732 sec
    [junit] Running org.apache.ivy.ant.AntBuildTriggerTest
    [junit] Tests run: 1, Failures: 0, Errors: 0, Time elapsed: 1,031 sec
    [junit] Running org.apache.ivy.ant.AntCallTriggerTest
    [junit] Tests run: 1, Failures: 0, Errors: 0, Time elapsed: 0,808 sec
    [junit] Running org.apache.ivy.ant.FixDepsTaskTest
    [junit] Tests run: 4, Failures: 0, Errors: 0, Time elapsed: 1,01 sec
    [junit] Running org.apache.ivy.ant.IvyAntSettingsBuildFileTest
    [junit] Tests run: 5, Failures: 0, Errors: 0, Time elapsed: 1,029 sec
    [junit] Running org.apache.ivy.ant.IvyArtifactPropertyTest
    [junit] Tests run: 3, Failures: 0, Errors: 0, Time elapsed: 0,931 sec
    [junit] Running org.apache.ivy.ant.IvyArtifactReportTest
    [junit] Tests run: 1, Failures: 0, Errors: 0, Time elapsed: 0,649 sec
    [junit] Running org.apache.ivy.ant.IvyBuildListTest
    [junit] Tests run: 21, Failures: 0, Errors: 0, Time elapsed: 2,179 sec
    [junit] Running org.apache.ivy.ant.IvyBuildNumberTest
    [junit] Tests run: 12, Failures: 0, Errors: 0, Time elapsed: 0,636 sec
    [junit] Running org.apache.ivy.ant.IvyCacheFilesetTest
    [junit] Tests run: 7, Failures: 0, Errors: 0, Time elapsed: 3,635 sec
    [junit] Running org.apache.ivy.ant.IvyCachePathTest
    [junit] Tests run: 12, Failures: 0, Errors: 0, Time elapsed: 2,58 sec
    [junit] Running org.apache.ivy.ant.IvyCleanCacheTest
    [junit] Tests run: 5, Failures: 0, Errors: 0, Time elapsed: 0,376 sec
    [junit] Running org.apache.ivy.ant.IvyConfigureTest
    [junit] Tests run: 13, Failures: 0, Errors: 0, Time elapsed: 0,564 sec
    [junit] Running org.apache.ivy.ant.IvyConvertPomTest
    [junit] Tests run: 1, Failures: 0, Errors: 0, Time elapsed: 0,816 sec
    [junit] Running org.apache.ivy.ant.IvyDeliverTest
    [junit] Tests run: 15, Failures: 0, Errors: 0, Time elapsed: 2,06 sec
    [junit] Running org.apache.ivy.ant.IvyDependencyTreeTest
    [junit] Tests run: 5, Failures: 0, Errors: 0, Time elapsed: 1,194 sec
    [junit] Running org.apache.ivy.ant.IvyFindRevisionTest
    [junit] Tests run: 3, Failures: 0, Errors: 0, Time elapsed: 0,525 sec
    [junit] Running org.apache.ivy.ant.IvyInfoRepositoryTest
    [junit] Tests run: 3, Failures: 0, Errors: 0, Time elapsed: 0,534 sec
    [junit] Running org.apache.ivy.ant.IvyInfoTest
    [junit] Tests run: 4, Failures: 0, Errors: 0, Time elapsed: 0,695 sec
    [junit] Running org.apache.ivy.ant.IvyInstallTest
    [junit] Tests run: 14, Failures: 0, Errors: 0, Time elapsed: 2,034 sec
    [junit] Running org.apache.ivy.ant.IvyListModulesTest
    [junit] Tests run: 2, Failures: 0, Errors: 0, Time elapsed: 0,427 sec
    [junit] Running org.apache.ivy.ant.IvyPostResolveTaskTest
    [junit] Tests run: 13, Failures: 0, Errors: 0, Time elapsed: 1,526 sec
    [junit] Running org.apache.ivy.ant.IvyPublishTest
    [junit] Tests run: 22, Failures: 0, Errors: 0, Time elapsed: 2,514 sec
    [junit] Running org.apache.ivy.ant.IvyReportTest
    [junit] Tests run: 6, Failures: 0, Errors: 0, Time elapsed: 2,022 sec
    [junit] Running org.apache.ivy.ant.IvyRepositoryReportTest
    [junit] Tests run: 3, Failures: 0, Errors: 0, Time elapsed: 0,969 sec
    [junit] Running org.apache.ivy.ant.IvyResolveTest
    [junit] Tests run: 32, Failures: 0, Errors: 0, Time elapsed: 2,235 sec
    [junit] Running org.apache.ivy.ant.IvyResourcesTest
    [junit] Tests run: 8, Failures: 0, Errors: 0, Time elapsed: 1,275 sec
    [junit] Running org.apache.ivy.ant.IvyRetrieveBuildFileTest
    [junit] Tests run: 1, Failures: 0, Errors: 0, Time elapsed: 0,638 sec
    [junit] Running org.apache.ivy.ant.IvyRetrieveTest
    [junit] Tests run: 19, Failures: 0, Errors: 0, Time elapsed: 1,995 sec
    [junit] Running org.apache.ivy.ant.IvyTaskTest
    [junit] Tests run: 3, Failures: 0, Errors: 0, Time elapsed: 0,405 sec
    [junit] Running org.apache.ivy.ant.IvyVarTest
    [junit] Tests run: 4, Failures: 0, Errors: 0, Time elapsed: 0,465 sec
    [junit] Running org.apache.ivy.core.NormalRelativeUrlResolverTest
    [junit] Tests run: 7, Failures: 0, Errors: 0, Time elapsed: 1,073 sec
    [junit] Running org.apache.ivy.core.cache.DefaultRepositoryCacheManagerTest
    [junit] Tests run: 2, Failures: 0, Errors: 0, Time elapsed: 0,385 sec
    [junit] Running org.apache.ivy.core.cache.ModuleDescriptorMemoryCacheTest
    [junit] Tests run: 10, Failures: 0, Errors: 0, Time elapsed: 0,048 sec
    [junit] Running org.apache.ivy.core.deliver.DeliverTest
    [junit] Tests run: 1, Failures: 0, Errors: 0, Time elapsed: 0,793 sec
    [junit] Running org.apache.ivy.core.event.IvyEventFilterTest
    [junit] Tests run: 5, Failures: 0, Errors: 0, Time elapsed: 0,334 sec
    [junit] Running org.apache.ivy.core.install.InstallTest
    [junit] Tests run: 9, Failures: 0, Errors: 0, Time elapsed: 4,717 sec
    [junit] Running org.apache.ivy.core.module.descriptor.DefaultDependencyDescriptorTest
    [junit] Tests run: 2, Failures: 0, Errors: 0, Time elapsed: 0,14 sec
    [junit] Running org.apache.ivy.core.module.id.ModuleIdTest
    [junit] Tests run: 11, Failures: 0, Errors: 0, Time elapsed: 0,141 sec
    [junit] Running org.apache.ivy.core.module.id.ModuleRevisionIdTest
    [junit] Tests run: 2, Failures: 0, Errors: 0, Time elapsed: 0,144 sec
    [junit] Running org.apache.ivy.core.module.id.ModuleRulesTest
    [junit] Tests run: 2, Failures: 0, Errors: 0, Time elapsed: 0,147 sec
    [junit] Running org.apache.ivy.core.publish.PublishEngineTest
    [junit] Tests run: 1, Failures: 0, Errors: 0, Time elapsed: 0,662 sec
    [junit] Running org.apache.ivy.core.publish.PublishEventsTest
    [junit] Tests run: 4, Failures: 0, Errors: 0, Time elapsed: 0,369 sec
    [junit] Running org.apache.ivy.core.repository.RepositoryManagementEngineTest
    [junit] Tests run: 2, Failures: 0, Errors: 0, Time elapsed: 1,136 sec
    [junit] Running org.apache.ivy.core.resolve.ResolveEngineTest
    [junit] Tests run: 2, Failures: 0, Errors: 0, Time elapsed: 0,424 sec
    [junit] Running org.apache.ivy.core.resolve.ResolveTest
    [junit] Tests run: 227, Failures: 0, Errors: 0, Time elapsed: 11,913 sec
    [junit] Running org.apache.ivy.core.retrieve.RetrieveTest
    [junit] Tests run: 11, Failures: 0, Errors: 0, Time elapsed: 1,477 sec
    [junit] Running org.apache.ivy.core.search.SearchTest
    [junit] Tests run: 3, Failures: 0, Errors: 0, Time elapsed: 0,351 sec
    [junit] Running org.apache.ivy.core.settings.ConfigureTest
    [junit] Tests run: 4, Failures: 0, Errors: 0, Time elapsed: 0,375 sec
    [junit] Running org.apache.ivy.core.settings.IvySettingsTest
    [junit] Tests run: 2, Failures: 0, Errors: 0, Time elapsed: 0,346 sec
    [junit] Running org.apache.ivy.core.settings.OnlineXmlSettingsParserTest
    [junit] Tests run: 4, Failures: 0, Errors: 0, Time elapsed: 1,177 sec
    [junit] Running org.apache.ivy.core.settings.XmlSettingsParserTest
    [junit] Tests run: 25, Failures: 0, Errors: 0, Time elapsed: 0,524 sec
    [junit] Running org.apache.ivy.core.sort.SortTest
    [junit] Tests run: 8, Failures: 0, Errors: 0, Time elapsed: 0,36 sec
    [junit] Running org.apache.ivy.osgi.core.ExecutionEnvironmentProfileLoaderTest
    [junit] Tests run: 1, Failures: 0, Errors: 0, Time elapsed: 0,154 sec
    [junit] Running org.apache.ivy.osgi.core.ManifestHeaderTest
    [junit] Tests run: 4, Failures: 0, Errors: 0, Time elapsed: 0,143 sec
    [junit] Running org.apache.ivy.osgi.core.ManifestParserTest
    [junit] Tests run: 3, Failures: 0, Errors: 0, Time elapsed: 0,15 sec
    [junit] Running org.apache.ivy.osgi.core.OSGiManifestParserTest
    [junit] Tests run: 1, Failures: 0, Errors: 0, Time elapsed: 0,341 sec
    [junit] Running org.apache.ivy.osgi.core.OsgiLatestStrategyTest
    [junit] Tests run: 3, Failures: 0, Errors: 0, Time elapsed: 0,34 sec
    [junit] Running org.apache.ivy.osgi.obr.OBRParserTest
    [junit] Tests run: 2, Failures: 0, Errors: 0, Time elapsed: 2,229 sec
    [junit] Running org.apache.ivy.osgi.obr.OBRResolverTest
    [junit] Tests run: 15, Failures: 0, Errors: 0, Time elapsed: 0,867 sec
    [junit] Running org.apache.ivy.osgi.obr.RequirementFilterTest
    [junit] Tests run: 1, Failures: 0, Errors: 0, Time elapsed: 0,139 sec
    [junit] Running org.apache.ivy.osgi.p2.P2DescriptorTest
    [junit] Tests run: 3, Failures: 0, Errors: 0, Time elapsed: 0,624 sec
    [junit] Running org.apache.ivy.osgi.repo.BundleRepoTest
    [junit] Tests run: 4, Failures: 0, Errors: 0, Time elapsed: 1,686 sec
    [junit] Running org.apache.ivy.osgi.updatesite.UpdateSiteAndIbiblioResolverTest
    [junit] Tests run: 1, Failures: 0, Errors: 0, Time elapsed: 0,697 sec
    [junit] Running org.apache.ivy.osgi.updatesite.UpdateSiteLoaderTest
    [junit] Tests run: 3, Failures: 0, Errors: 0, Time elapsed: 15,551 sec
    [junit] Running org.apache.ivy.osgi.updatesite.UpdateSiteResolverTest
    [junit] Tests run: 3, Failures: 0, Errors: 0, Time elapsed: 0,719 sec
    [junit] Running org.apache.ivy.osgi.util.ParseUtilTest
    [junit] Tests run: 1, Failures: 0, Errors: 0, Time elapsed: 0,136 sec
    [junit] Running org.apache.ivy.osgi.util.VersionRangeTest
    [junit] Tests run: 2, Failures: 0, Errors: 0, Time elapsed: 0,14 sec
    [junit] Running org.apache.ivy.osgi.util.VersionTest
    [junit] Tests run: 2, Failures: 0, Errors: 0, Time elapsed: 0,144 sec
    [junit] Running org.apache.ivy.plugins.circular.IgnoreCircularDependencyStrategyTest
    [junit] Tests run: 2, Failures: 0, Errors: 0, Time elapsed: 0,152 sec
    [junit] Running org.apache.ivy.plugins.circular.WarnCircularDependencyStrategyTest
    [junit] Tests run: 3, Failures: 0, Errors: 0, Time elapsed: 0,225 sec
    [junit] Running org.apache.ivy.plugins.conflict.LatestCompatibleConflictManagerTest
    [junit] Tests run: 12, Failures: 0, Errors: 0, Time elapsed: 2,36 sec
    [junit] Running org.apache.ivy.plugins.conflict.LatestConflictManagerTest
    [junit] Tests run: 5, Failures: 0, Errors: 0, Time elapsed: 0,754 sec
    [junit] Running org.apache.ivy.plugins.conflict.RegexpConflictManagerTest
    [junit] Tests run: 2, Failures: 0, Errors: 0, Time elapsed: 0,449 sec
    [junit] Running org.apache.ivy.plugins.conflict.StrictConflictManagerTest
    [junit] Tests run: 5, Failures: 0, Errors: 0, Time elapsed: 0,582 sec
    [junit] Running org.apache.ivy.plugins.latest.LatestRevisionStrategyTest
    [junit] Tests run: 4, Failures: 0, Errors: 0, Time elapsed: 0,358 sec
    [junit] Running org.apache.ivy.plugins.lock.ArtifactLockStrategyTest
    [junit] Tests run: 1, Failures: 0, Errors: 0, Time elapsed: 4,238 sec
    [junit] Running org.apache.ivy.plugins.matcher.ExactOrRegexpPatternMatcherTest
    [junit] Tests run: 7, Failures: 0, Errors: 0, Time elapsed: 0,414 sec
    [junit] Running org.apache.ivy.plugins.matcher.ExactPatternMatcherTest
    [junit] Tests run: 7, Failures: 0, Errors: 0, Time elapsed: 0,164 sec
    [junit] Running org.apache.ivy.plugins.matcher.GlobPatternMatcherTest
    [junit] Tests run: 13, Failures: 0, Errors: 0, Time elapsed: 0,726 sec
    [junit] Running org.apache.ivy.plugins.matcher.RegexpPatternMatcherTest
    [junit] Tests run: 7, Failures: 0, Errors: 0, Time elapsed: 0,406 sec
    [junit] Running org.apache.ivy.plugins.namespace.MRIDTransformationRuleTest
    [junit] Tests run: 1, Failures: 0, Errors: 0, Time elapsed: 0,156 sec
    [junit] Running org.apache.ivy.plugins.namespace.NameSpaceHelperTest
    [junit] Tests run: 1, Failures: 0, Errors: 0, Time elapsed: 0,151 sec
    [junit] Running org.apache.ivy.plugins.parser.ModuleDescriptorParserRegistryTest
    [junit] Tests run: 1, Failures: 0, Errors: 0, Time elapsed: 0,335 sec
    [junit] Running org.apache.ivy.plugins.parser.m2.PomModuleDescriptorParserTest
    [junit] Tests run: 39, Failures: 0, Errors: 0, Time elapsed: 0,879 sec
    [junit] Running org.apache.ivy.plugins.parser.m2.PomModuleDescriptorWriterTest
    [junit] Tests run: 11, Failures: 0, Errors: 0, Time elapsed: 0,553 sec
    [junit] Running org.apache.ivy.plugins.parser.xml.XmlModuleDescriptorParserTest
    [junit] Tests run: 40, Failures: 0, Errors: 0, Time elapsed: 3,199 sec
    [junit] Running org.apache.ivy.plugins.parser.xml.XmlModuleDescriptorWriterTest
    [junit] Tests run: 7, Failures: 0, Errors: 0, Time elapsed: 0,604 sec
    [junit] Running org.apache.ivy.plugins.parser.xml.XmlModuleUpdaterTest
    [junit] Tests run: 10, Failures: 0, Errors: 0, Time elapsed: 0,747 sec
    [junit] Running org.apache.ivy.plugins.report.XmlReportParserTest
    [junit] Tests run: 1, Failures: 0, Errors: 0, Time elapsed: 0,397 sec
    [junit] Running org.apache.ivy.plugins.report.XmlReportWriterTest
    [junit] Tests run: 3, Failures: 0, Errors: 0, Time elapsed: 0,673 sec
    [junit] Running org.apache.ivy.plugins.repository.vfs.VfsRepositoryTest
    [junit] Tests run: 7, Failures: 0, Errors: 0, Time elapsed: 0,542 sec
    [junit] Running org.apache.ivy.plugins.repository.vfs.VfsResourceTest
    [junit] Tests run: 6, Failures: 0, Errors: 0, Time elapsed: 0,49 sec
    [junit] Running org.apache.ivy.plugins.resolver.ChainResolverTest
    [junit] Tests run: 15, Failures: 0, Errors: 0, Time elapsed: 0,685 sec
    [junit] Running org.apache.ivy.plugins.resolver.DualResolverTest
    [junit] Tests run: 6, Failures: 0, Errors: 0, Time elapsed: 0,359 sec
    [junit] Running org.apache.ivy.plugins.resolver.FileSystemResolverTest
    [junit] Tests run: 25, Failures: 0, Errors: 0, Time elapsed: 1,062 sec
    [junit] Running org.apache.ivy.plugins.resolver.IBiblioResolverTest
    [junit] Tests run: 7, Failures: 0, Errors: 0, Time elapsed: 2,995 sec
    [junit] Running org.apache.ivy.plugins.resolver.IvyRepResolverTest
    [junit] Tests run: 3, Failures: 0, Errors: 0, Time elapsed: 0,611 sec
    [junit] Running org.apache.ivy.plugins.resolver.JarResolverTest
    [junit] Tests run: 3, Failures: 0, Errors: 0, Time elapsed: 0,652 sec
    [junit] Running org.apache.ivy.plugins.resolver.Maven2LocalTest
    [junit] Tests run: 2, Failures: 0, Errors: 0, Time elapsed: 0,473 sec
    [junit] Running org.apache.ivy.plugins.resolver.MirroredURLResolverTest
    [junit] Tests run: 3, Failures: 0, Errors: 0, Time elapsed: 0,792 sec
    [junit] Running org.apache.ivy.plugins.resolver.PackagerResolverTest
    [junit] Tests run: 3, Failures: 0, Errors: 0, Time elapsed: 1,761 sec
    [junit] Running org.apache.ivy.plugins.resolver.URLResolverTest
    [junit] Tests run: 9, Failures: 0, Errors: 0, Time elapsed: 2,499 sec
    [junit] Running org.apache.ivy.plugins.resolver.VfsResolverTest
    [junit] Tests run: 2, Failures: 0, Errors: 0, Time elapsed: 0,162 sec
    [junit] Running org.apache.ivy.plugins.resolver.util.ResolverHelperTest
    [junit] Tests run: 1, Failures: 0, Errors: 0, Time elapsed: 0,148 sec
    [junit] Running org.apache.ivy.plugins.trigger.LogTriggerTest
    [junit] Tests run: 3, Failures: 0, Errors: 0, Time elapsed: 0,332 sec
    [junit] Running org.apache.ivy.plugins.version.LatestVersionMatcherTest
    [junit] Tests run: 2, Failures: 0, Errors: 0, Time elapsed: 0,35 sec
    [junit] Running org.apache.ivy.plugins.version.PatternVersionMatcherTest
    [junit] Tests run: 3, Failures: 0, Errors: 0, Time elapsed: 0,327 sec
    [junit] Running org.apache.ivy.plugins.version.VersionRangeMatcherTest
    [junit] Tests run: 6, Failures: 0, Errors: 0, Time elapsed: 0,347 sec
    [junit] Running org.apache.ivy.util.ConfiguratorTest
    [junit] Tests run: 13, Failures: 0, Errors: 0, Time elapsed: 0,156 sec
    [junit] Running org.apache.ivy.util.IvyPatternHelperTest
    [junit] Tests run: 7, Failures: 0, Errors: 0, Time elapsed: 0,145 sec
    [junit] Running org.apache.ivy.util.StringUtilsTest
    [junit] Tests run: 2, Failures: 0, Errors: 0, Time elapsed: 0,137 sec
    [junit] Running org.apache.ivy.util.url.ApacheURLListerTest
    [junit] Tests run: 6, Failures: 0, Errors: 0, Time elapsed: 0,29 sec
    [junit] Running org.apache.ivy.util.url.ArtifactoryListingTest
    [junit] Tests run: 1, Failures: 0, Errors: 0, Time elapsed: 0,649 sec
    [junit] Running org.apache.ivy.util.url.BasicURLHandlerTest
    [junit] Tests run: 2, Failures: 0, Errors: 1, Time elapsed: 65,592 sec
    [junit] Test org.apache.ivy.util.url.BasicURLHandlerTest FAILED
    [junit] Running org.apache.ivy.util.url.HttpclientURLHandlerTest
    [junit] Tests run: 3, Failures: 0, Errors: 1, Time elapsed: 252,958 sec
    [junit] Test org.apache.ivy.util.url.HttpclientURLHandlerTest FAILED

test-report:
[junitreport] Processing <https://builds.apache.org/job/Ivy-tests/./jdk=JDK%201.5%20(latest),label=Ubuntu/ws/trunk/build/test-report/TESTS-TestSuites.xml>
to /tmp/null425735105
[junitreport] Loading stylesheet jar:file:/home/hudson/tools/ant/apache-ant-1.7.0/lib/ant-junit.jar!/org/apache/tools/ant/taskdefs/optional/junit/xsl/junit-frames.xsl
[junitreport] Transform time: 2264ms
[junitreport] Deleting: /tmp/null425735105

BUILD FAILED
<https://builds.apache.org/job/Ivy-tests/./jdk=JDK%201.5%20(latest),label=Ubuntu/ws/trunk/build.xml>:497:
At least one test has failed. See logs (in <https://builds.apache.org/job/Ivy-tests/./jdk=JDK%201.5%20(latest),label=Ubuntu/ws/trunk/build/test-report)>
or report (in <https://builds.apache.org/job/Ivy-tests/./jdk=JDK%201.5%20(latest),label=Ubuntu/ws/trunk/build/doc/reports/test)>

Total time: 8 minutes 6 seconds
Build step 'Invoke Ant' marked build as failure
Recording test results

Mime
View raw message