ant-notifications mailing list archives

Site index · List index
Message view « Date » · « Thread »
Top « Date » · « Thread »
From Apache Jenkins Server <jenk...@builds.apache.org>
Subject Build failed in Jenkins: Ant-Build-Matrix » JDK 1.5 (latest),Ubuntu #515
Date Mon, 20 Aug 2012 18:07:39 GMT
See <https://builds.apache.org/job/Ant-Build-Matrix/./jdk=JDK%201.5%20(latest),label=Ubuntu/515/changes>

Changes:

[mbenson] java 5 updates

[mbenson] Any FileResource whose represented File has a parent also has a basedir.

------------------------------------------
Started by upstream project "Ant-Build-Matrix" build number 515
Building remotely on ubuntu2 in workspace <https://builds.apache.org/job/Ant-Build-Matrix/./jdk=JDK%201.5%20(latest),label=Ubuntu/ws/>
Updating http://svn.apache.org/repos/asf/ant/core/trunk
AU        src/tests/junit/org/apache/tools/ant/types/resources/FileResourceTest.java
U         src/main/org/apache/tools/ant/AntClassLoader.java
U         src/main/org/apache/tools/ant/IntrospectionHelper.java
U         src/main/org/apache/tools/ant/ComponentHelper.java
U         src/main/org/apache/tools/ant/TaskAdapter.java
U         src/main/org/apache/tools/ant/property/LocalPropertyStack.java
U         src/main/org/apache/tools/ant/property/LocalProperties.java
U         src/main/org/apache/tools/ant/ProjectHelperRepository.java
U         src/main/org/apache/tools/ant/Diagnostics.java
U         src/main/org/apache/tools/ant/UnknownElement.java
U         src/main/org/apache/tools/ant/DirectoryScanner.java
U         src/main/org/apache/tools/ant/DemuxOutputStream.java
U         src/main/org/apache/tools/ant/UnsupportedElementException.java
U         src/main/org/apache/tools/ant/PropertyHelper.java
U         src/main/org/apache/tools/ant/UnsupportedAttributeException.java
U         src/main/org/apache/tools/ant/XmlLogger.java
U         src/main/org/apache/tools/ant/Task.java
U         src/main/org/apache/tools/ant/RuntimeConfigurable.java
U         src/main/org/apache/tools/ant/Project.java
U         src/main/org/apache/tools/ant/ProjectHelper.java
U         src/main/org/apache/tools/ant/Location.java
U         src/main/org/apache/tools/ant/BuildException.java
U         src/main/org/apache/tools/ant/TypeAdapter.java
U         src/main/org/apache/tools/ant/Main.java
U         src/main/org/apache/tools/ant/taskdefs/MacroDef.java
U         src/main/org/apache/tools/ant/types/FilterSet.java
U         src/main/org/apache/tools/ant/types/resources/FileResource.java
U         src/main/org/apache/tools/ant/Target.java
U         src/main/org/apache/tools/ant/AntTypeDefinition.java
U         src/main/org/apache/tools/ant/util/CollectionUtils.java
U         src/main/org/apache/tools/ant/util/VectorSet.java
U         src/main/org/apache/tools/ant/util/JavaEnvUtils.java
U         WHATSNEW
At revision 1375150
[trunk] $ /home/hudson/hudson-slave/tools/Ant/ant-1.8.2/bin/ant -file launch-build.xml -Dlabel=Ubuntu
"-Djdk=JDK 1.5 (latest)" "-Dargs=allclean test -Dignore.tests.failed=true -Doptional.jars.whenmanifestonly=skip"
Buildfile: <https://builds.apache.org/job/Ant-Build-Matrix/./jdk=JDK%201.5%20(latest),label=Ubuntu/ws/trunk/launch-build.xml>

launch:
     [echo] Launching ./build.sh allclean test -Dignore.tests.failed=true -Doptional.jars.whenmanifestonly=skip
     [exec] The command attribute is deprecated.
     [exec] Please use the executable attribute and nested arg elements.
     [exec] ... Bootstrapping Ant Distribution
     [exec] ... Compiling Ant Classes
     [exec] Note: Some input files use or override a deprecated API.
     [exec] Note: Recompile with -Xlint:deprecation for details.
     [exec] Note: Some input files use unchecked or unsafe operations.
     [exec] Note: Recompile with -Xlint:unchecked for details.
     [exec] ... Copying Required Files
     [exec] ... Building Ant Distribution
     [exec] Buildfile: <https://builds.apache.org/job/Ant-Build-Matrix/./jdk=JDK%201.5%20(latest),label=Ubuntu/ws/trunk/build.xml>
     [exec] 
     [exec] bootstrap:
     [exec] 
     [exec] prepare:
     [exec] 
     [exec] check_for_optional_packages:
     [exec] 
     [exec] build:
     [exec] Created dir: <https://builds.apache.org/job/Ant-Build-Matrix/./jdk=JDK%201.5%20(latest),label=Ubuntu/ws/trunk/build/lib>
     [exec] Compiling 252 source files to <https://builds.apache.org/job/Ant-Build-Matrix/./jdk=JDK%201.5%20(latest),label=Ubuntu/ws/trunk/build/classes>
     [exec] Note: Some input files use or override a deprecated API.
     [exec] Note: Recompile with -Xlint:deprecation for details.
     [exec] Note: Some input files use unchecked or unsafe operations.
     [exec] Note: Recompile with -Xlint:unchecked for details.
     [exec] Copying 5 files to <https://builds.apache.org/job/Ant-Build-Matrix/./jdk=JDK%201.5%20(latest),label=Ubuntu/ws/trunk/build/classes>
     [exec] Copying 2 files to <https://builds.apache.org/job/Ant-Build-Matrix/./jdk=JDK%201.5%20(latest),label=Ubuntu/ws/trunk/build/classes>
     [exec] Copying 2 files to <https://builds.apache.org/job/Ant-Build-Matrix/./jdk=JDK%201.5%20(latest),label=Ubuntu/ws/trunk/build/classes/org/apache/tools/ant/taskdefs/optional/junit/xsl>
     [exec] 
     [exec] jars:
     [exec] Copying 2 files to <https://builds.apache.org/job/Ant-Build-Matrix/./jdk=JDK%201.5%20(latest),label=Ubuntu/ws/trunk/build>
     [exec] Copying 1 file to <https://builds.apache.org/job/Ant-Build-Matrix/./jdk=JDK%201.5%20(latest),label=Ubuntu/ws/trunk/build>
     [exec] Building jar: <https://builds.apache.org/job/Ant-Build-Matrix/./jdk=JDK%201.5%20(latest),label=Ubuntu/ws/trunk/build/lib/ant-launcher.jar>
     [exec] Building jar: <https://builds.apache.org/job/Ant-Build-Matrix/./jdk=JDK%201.5%20(latest),label=Ubuntu/ws/trunk/build/lib/ant.jar>
     [exec] Building jar: <https://builds.apache.org/job/Ant-Build-Matrix/./jdk=JDK%201.5%20(latest),label=Ubuntu/ws/trunk/build/lib/ant-bootstrap.jar>
     [exec] Building jar: <https://builds.apache.org/job/Ant-Build-Matrix/./jdk=JDK%201.5%20(latest),label=Ubuntu/ws/trunk/build/lib/ant-apache-resolver.jar>
     [exec] Building jar: <https://builds.apache.org/job/Ant-Build-Matrix/./jdk=JDK%201.5%20(latest),label=Ubuntu/ws/trunk/build/lib/ant-junit.jar>
     [exec] Building jar: <https://builds.apache.org/job/Ant-Build-Matrix/./jdk=JDK%201.5%20(latest),label=Ubuntu/ws/trunk/build/lib/ant-junit4.jar>
     [exec] Building jar: <https://builds.apache.org/job/Ant-Build-Matrix/./jdk=JDK%201.5%20(latest),label=Ubuntu/ws/trunk/build/lib/ant-apache-regexp.jar>
     [exec] Building jar: <https://builds.apache.org/job/Ant-Build-Matrix/./jdk=JDK%201.5%20(latest),label=Ubuntu/ws/trunk/build/lib/ant-apache-oro.jar>
     [exec] Building jar: <https://builds.apache.org/job/Ant-Build-Matrix/./jdk=JDK%201.5%20(latest),label=Ubuntu/ws/trunk/build/lib/ant-apache-bcel.jar>
     [exec] Building jar: <https://builds.apache.org/job/Ant-Build-Matrix/./jdk=JDK%201.5%20(latest),label=Ubuntu/ws/trunk/build/lib/ant-apache-log4j.jar>
     [exec] Building jar: <https://builds.apache.org/job/Ant-Build-Matrix/./jdk=JDK%201.5%20(latest),label=Ubuntu/ws/trunk/build/lib/ant-commons-logging.jar>
     [exec] Building jar: <https://builds.apache.org/job/Ant-Build-Matrix/./jdk=JDK%201.5%20(latest),label=Ubuntu/ws/trunk/build/lib/ant-apache-bsf.jar>
     [exec] Building jar: <https://builds.apache.org/job/Ant-Build-Matrix/./jdk=JDK%201.5%20(latest),label=Ubuntu/ws/trunk/build/lib/ant-javamail.jar>
     [exec] Building jar: <https://builds.apache.org/job/Ant-Build-Matrix/./jdk=JDK%201.5%20(latest),label=Ubuntu/ws/trunk/build/lib/ant-netrexx.jar>
     [exec] Building jar: <https://builds.apache.org/job/Ant-Build-Matrix/./jdk=JDK%201.5%20(latest),label=Ubuntu/ws/trunk/build/lib/ant-commons-net.jar>
     [exec] Building jar: <https://builds.apache.org/job/Ant-Build-Matrix/./jdk=JDK%201.5%20(latest),label=Ubuntu/ws/trunk/build/lib/ant-antlr.jar>
     [exec] Building jar: <https://builds.apache.org/job/Ant-Build-Matrix/./jdk=JDK%201.5%20(latest),label=Ubuntu/ws/trunk/build/lib/ant-jmf.jar>
     [exec] Building jar: <https://builds.apache.org/job/Ant-Build-Matrix/./jdk=JDK%201.5%20(latest),label=Ubuntu/ws/trunk/build/lib/ant-jai.jar>
     [exec] Building jar: <https://builds.apache.org/job/Ant-Build-Matrix/./jdk=JDK%201.5%20(latest),label=Ubuntu/ws/trunk/build/lib/ant-swing.jar>
     [exec] Building jar: <https://builds.apache.org/job/Ant-Build-Matrix/./jdk=JDK%201.5%20(latest),label=Ubuntu/ws/trunk/build/lib/ant-jsch.jar>
     [exec] Building jar: <https://builds.apache.org/job/Ant-Build-Matrix/./jdk=JDK%201.5%20(latest),label=Ubuntu/ws/trunk/build/lib/ant-jdepend.jar>
     [exec] Building jar: <https://builds.apache.org/job/Ant-Build-Matrix/./jdk=JDK%201.5%20(latest),label=Ubuntu/ws/trunk/build/lib/ant-apache-xalan2.jar>
     [exec] 
     [exec] compile-tests:
     [exec] Created dir: <https://builds.apache.org/job/Ant-Build-Matrix/./jdk=JDK%201.5%20(latest),label=Ubuntu/ws/trunk/build/testcases>
     [exec] Compiling 293 source files to <https://builds.apache.org/job/Ant-Build-Matrix/./jdk=JDK%201.5%20(latest),label=Ubuntu/ws/trunk/build/testcases>
     [exec] <https://builds.apache.org/job/Ant-Build-Matrix/./jdk=JDK%201.5%20(latest),label=Ubuntu/ws/trunk/src/tests/junit/org/apache/tools/ant/types/RedirectorElementTest.java>:35:
unexpected type
     [exec] found   : java.lang.Object
     [exec] required: reference
     [exec]         assertTrue((getProject().getReference("test1")
     [exec]                                              ^
     [exec] 
     [exec] BUILD FAILED
     [exec] <https://builds.apache.org/job/Ant-Build-Matrix/./jdk=JDK%201.5%20(latest),label=Ubuntu/ws/trunk/build.xml>:1054:
The following error occurred while executing this line:
     [exec] <https://builds.apache.org/job/Ant-Build-Matrix/./jdk=JDK%201.5%20(latest),label=Ubuntu/ws/trunk/build.xml>:1504:
Compile failed; see the compiler error output for details.
     [exec] 
     [exec] Total time: 9 seconds
     [exec] Note: Some input files use or override a deprecated API.
     [exec] Note: Recompile with -Xlint:deprecation for details.
     [exec] Note: Some input files use unchecked or unsafe operations.
     [exec] Note: Recompile with -Xlint:unchecked for details.
     [exec] 1 error
     [exec] ... Failed Building Ant Distribution !
     [exec] Bootstrap FAILED

BUILD FAILED
<https://builds.apache.org/job/Ant-Build-Matrix/./jdk=JDK%201.5%20(latest),label=Ubuntu/ws/trunk/launch-build.xml>:36:
exec returned: 1

Total time: 22 seconds
Build step 'Invoke Ant' marked build as failure
Recording test results

Mime
View raw message