ant-notifications mailing list archives

Site index · List index
Message view « Date » · « Thread »
Top « Date » · « Thread »
From Apache Jenkins Server <jenk...@builds.apache.org>
Subject Build failed in Jenkins: Ant-Build-Matrix » JDK 1.5 (latest),Windows #516
Date Tue, 21 Aug 2012 17:01:57 GMT
See <https://builds.apache.org/job/Ant-Build-Matrix/./jdk=JDK%201.5%20(latest),label=Windows/516/changes>

Changes:

[mbenson] java 5, continued

[mbenson] cross-platform

------------------------------------------
Started by upstream project "Ant-Build-Matrix" build number 516
Building remotely on windows1 in workspace <https://builds.apache.org/job/Ant-Build-Matrix/./jdk=JDK%201.5%20(latest),label=Windows/ws/>
Updating http://svn.apache.org/repos/asf/ant/core/trunk
U         src\tests\junit\org\apache\tools\ant\types\resources\FileResourceTest.java
U         src\main\org\apache\tools\ant\property\ResolvePropertyMap.java
U         src\main\org\apache\tools\ant\property\ParseProperties.java
U         src\main\org\apache\tools\ant\listener\ProfileLogger.java
U         src\main\org\apache\tools\ant\listener\MailLogger.java
U         src\main\org\apache\tools\ant\input\MultipleChoiceInputRequest.java
U         src\main\org\apache\tools\ant\input\DefaultInputHandler.java
U         src\main\org\apache\tools\ant\input\SecureInputHandler.java
U         src\main\org\apache\tools\ant\filters\TailFilter.java
U         src\main\org\apache\tools\ant\filters\ReplaceTokens.java
U         src\main\org\apache\tools\ant\filters\LineContainsRegExp.java
U         src\main\org\apache\tools\ant\filters\ClassConstants.java
U         src\main\org\apache\tools\ant\filters\FixCrLfFilter.java
U         src\main\org\apache\tools\ant\filters\StripLineComments.java
U         src\main\org\apache\tools\ant\filters\LineContains.java
U         src\main\org\apache\tools\ant\filters\TokenFilter.java
U         src\main\org\apache\tools\ant\filters\SortFilter.java
U         src\main\org\apache\tools\ant\filters\util\ChainReaderHelper.java
U         src\main\org\apache\tools\ant\helper\AntXMLContext.java
U         src\main\org\apache\tools\ant\helper\ProjectHelper2.java
U         src\main\org\apache\tools\ant\helper\ProjectHelperImpl.java
U         src\main\org\apache\tools\ant\helper\IgnoreDependenciesExecutor.java
U         src\main\org\apache\tools\ant\Project.java
U         src\main\org\apache\tools\ant\dispatch\DispatchUtils.java
U         src\main\org\apache\tools\ant\Main.java
U         src\main\org\apache\tools\ant\taskdefs\Input.java
U         src\main\org\apache\tools\ant\taskdefs\Delete.java
U         src\main\org\apache\tools\ant\taskdefs\AntStructure.java
U         src\main\org\apache\tools\ant\taskdefs\Definer.java
U         src\main\org\apache\tools\ant\taskdefs\Expand.java
U         src\main\org\apache\tools\ant\taskdefs\AugmentReference.java
U         src\main\org\apache\tools\ant\taskdefs\Java.java
U         src\main\org\apache\tools\ant\taskdefs\Apt.java
U         src\main\org\apache\tools\ant\taskdefs\ImportTask.java
U         src\main\org\apache\tools\ant\taskdefs\MakeUrl.java
U         src\main\org\apache\tools\ant\taskdefs\AbstractCvsTask.java
U         src\main\org\apache\tools\ant\taskdefs\Zip.java
U         src\main\org\apache\tools\ant\taskdefs\KeySubst.java
U         src\main\org\apache\tools\ant\taskdefs\LoadResource.java
U         src\main\org\apache\tools\ant\taskdefs\LoadProperties.java
U         src\main\org\apache\tools\ant\taskdefs\Checksum.java
U         src\main\org\apache\tools\ant\taskdefs\Execute.java
U         src\main\org\apache\tools\ant\taskdefs\ExecuteJava.java
U         src\main\org\apache\tools\ant\taskdefs\Manifest.java
U         src\main\org\apache\tools\ant\taskdefs\BindTargets.java
U         src\main\org\apache\tools\ant\taskdefs\Concat.java
U         src\main\org\apache\tools\ant\taskdefs\Antlib.java
U         src\main\org\apache\tools\ant\taskdefs\Jar.java
U         src\main\org\apache\tools\ant\taskdefs\MacroInstance.java
U         src\main\org\apache\tools\ant\taskdefs\GenerateKey.java
U         src\main\org\apache\tools\ant\taskdefs\Ant.java
U         src\main\org\apache\tools\ant\taskdefs\Javac.java
U         src\main\org\apache\tools\ant\taskdefs\JDBCTask.java
U         src\main\org\apache\tools\ant\taskdefs\AbstractJarSignerTask.java
U         src\main\org\apache\tools\ant\taskdefs\Javadoc.java
U         src\main\org\apache\tools\ant\taskdefs\Length.java
U         src\main\org\apache\tools\ant\taskdefs\HostInfo.java
U         src\main\org\apache\tools\ant\taskdefs\email\Mailer.java
U         src\main\org\apache\tools\ant\taskdefs\email\EmailTask.java
U         src\main\org\apache\tools\ant\taskdefs\ExecTask.java
U         src\main\org\apache\tools\ant\taskdefs\Copydir.java
U         src\main\org\apache\tools\ant\taskdefs\FixCRLF.java
U         src\main\org\apache\tools\ant\taskdefs\ExecuteOn.java
U         src\main\org\apache\tools\ant\taskdefs\Copy.java
U         src\main\org\apache\tools\ant\types\AntFilterReader.java
U         src\main\org\apache\tools\ant\types\spi\Service.java
U         src\main\org\apache\tools\ant\types\Environment.java
U         src\main\org\apache\tools\ant\types\DataType.java
U         src\main\org\apache\tools\ant\types\FilterChain.java
U         src\main\org\apache\tools\ant\types\resources\Resources.java
U         src\main\org\apache\tools\ant\types\Path.java
U         src\main\org\apache\tools\ant\loader\AntClassLoader5.java
U         src\main\org\apache\tools\ant\launch\Launcher.java
U         src\main\org\apache\tools\ant\launch\Locator.java
U         src\main\org\apache\tools\ant\launch\LaunchException.java
U         src\main\org\apache\tools\ant\util\ReflectUtil.java
U         src\main\org\apache\tools\ant\util\LinkedHashtable.java
U         src\main\org\apache\tools\ant\util\StringUtils.java
U         src\main\org\apache\tools\ant\util\IdentityStack.java
At revision 1375595
[trunk] $ cmd.exe /C '"f:\hudson\hudson-slave\tools\Ant\ant-1.8.2\bin\ant.bat -file launch-build.xml
-Dlabel=Windows "-Djdk=JDK 1.5 (latest)" "-Dargs=allclean test -Dignore.tests.failed=true
-Doptional.jars.whenmanifestonly=skip" && exit %%ERRORLEVEL%%"'
Buildfile: <https://builds.apache.org/job/Ant-Build-Matrix/./jdk=JDK%201.5%20(latest),label=Windows/ws/trunk\launch-build.xml>

launch:
     [echo] Launching build.bat allclean test -Dignore.tests.failed=true -Doptional.jars.whenmanifestonly=skip
     [exec] The command attribute is deprecated.
     [exec] Please use the executable attribute and nested arg elements.
     [exec] 
     [exec] ... Bootstrapping Ant Distribution
     [exec] JAVA_HOME=f:\hudson\tools\java\latest-1.5-64
     [exec] JAVA=f:\hudson\tools\java\latest-1.5-64\bin\java
     [exec] JAVAC=f:\hudson\tools\java\latest-1.5-64\bin\javac
     [exec] CLASSPATH=;lib\optional\ant-antunit-1.2.jar;lib\optional\junit-3.8.2.jar;lib\optional\junit-4.8.1.jar;f:\hudson\tools\java\latest-1.5-64\lib\tools.jar;build\classes;src\main;
     [exec] 
     [exec] ... Compiling Ant Classes
     [exec] 
     [exec] ... Copying Required Files
     [exec] src\main\org\apache\tools\ant\taskdefs\defaults.properties
     [exec]         1 file(s) copied.
     [exec] src\main\org\apache\tools\ant\types\defaults.properties
     [exec]         1 file(s) copied.
     [exec] 
     [exec] ... Building Ant Distribution
     [exec] Note: Some input files use or override a deprecated API.
     [exec] Note: Recompile with -Xlint:deprecation for details.
     [exec] Note: Some input files use unchecked or unsafe operations.
     [exec] Note: Recompile with -Xlint:unchecked for details.
     [exec] Buildfile: <https://builds.apache.org/job/Ant-Build-Matrix/./jdk=JDK%201.5%20(latest),label=Windows/ws/trunk\build.xml>
     [exec] 
     [exec] bootstrap:
     [exec] 
     [exec] prepare:
     [exec] 
     [exec] check_for_optional_packages:
     [exec] 
     [exec] build:
     [exec] Created dir: <https://builds.apache.org/job/Ant-Build-Matrix/./jdk=JDK%201.5%20(latest),label=Windows/ws/trunk\build\lib>
     [exec] Compiling 252 source files to <https://builds.apache.org/job/Ant-Build-Matrix/./jdk=JDK%201.5%20(latest),label=Windows/ws/trunk\build\classes>
     [exec] Note: Some input files use or override a deprecated API.
     [exec] Note: Recompile with -Xlint:deprecation for details.
     [exec] Note: Some input files use unchecked or unsafe operations.
     [exec] Note: Recompile with -Xlint:unchecked for details.
     [exec] Copying 5 files to <https://builds.apache.org/job/Ant-Build-Matrix/./jdk=JDK%201.5%20(latest),label=Windows/ws/trunk\build\classes>
     [exec] Copying 2 files to <https://builds.apache.org/job/Ant-Build-Matrix/./jdk=JDK%201.5%20(latest),label=Windows/ws/trunk\build\classes>
     [exec] Copying 2 files to <https://builds.apache.org/job/Ant-Build-Matrix/./jdk=JDK%201.5%20(latest),label=Windows/ws/trunk\build\classes\org\apache\tools\ant\taskdefs\optional\junit\xsl>
     [exec] 
     [exec] jars:
     [exec] Copying 2 files to <https://builds.apache.org/job/Ant-Build-Matrix/./jdk=JDK%201.5%20(latest),label=Windows/ws/trunk\build>
     [exec] Copying 1 file to <https://builds.apache.org/job/Ant-Build-Matrix/./jdk=JDK%201.5%20(latest),label=Windows/ws/trunk\build>
     [exec] Building jar: <https://builds.apache.org/job/Ant-Build-Matrix/./jdk=JDK%201.5%20(latest),label=Windows/ws/trunk\build\lib\ant-launcher.jar>
     [exec] Building jar: <https://builds.apache.org/job/Ant-Build-Matrix/./jdk=JDK%201.5%20(latest),label=Windows/ws/trunk\build\lib\ant.jar>
     [exec] Building jar: <https://builds.apache.org/job/Ant-Build-Matrix/./jdk=JDK%201.5%20(latest),label=Windows/ws/trunk\build\lib\ant-bootstrap.jar>
     [exec] Building jar: <https://builds.apache.org/job/Ant-Build-Matrix/./jdk=JDK%201.5%20(latest),label=Windows/ws/trunk\build\lib\ant-apache-resolver.jar>
     [exec] Building jar: <https://builds.apache.org/job/Ant-Build-Matrix/./jdk=JDK%201.5%20(latest),label=Windows/ws/trunk\build\lib\ant-junit.jar>
     [exec] Building jar: <https://builds.apache.org/job/Ant-Build-Matrix/./jdk=JDK%201.5%20(latest),label=Windows/ws/trunk\build\lib\ant-junit4.jar>
     [exec] Building jar: <https://builds.apache.org/job/Ant-Build-Matrix/./jdk=JDK%201.5%20(latest),label=Windows/ws/trunk\build\lib\ant-apache-regexp.jar>
     [exec] Building jar: <https://builds.apache.org/job/Ant-Build-Matrix/./jdk=JDK%201.5%20(latest),label=Windows/ws/trunk\build\lib\ant-apache-oro.jar>
     [exec] Building jar: <https://builds.apache.org/job/Ant-Build-Matrix/./jdk=JDK%201.5%20(latest),label=Windows/ws/trunk\build\lib\ant-apache-bcel.jar>
     [exec] Building jar: <https://builds.apache.org/job/Ant-Build-Matrix/./jdk=JDK%201.5%20(latest),label=Windows/ws/trunk\build\lib\ant-apache-log4j.jar>
     [exec] Building jar: <https://builds.apache.org/job/Ant-Build-Matrix/./jdk=JDK%201.5%20(latest),label=Windows/ws/trunk\build\lib\ant-commons-logging.jar>
     [exec] Building jar: <https://builds.apache.org/job/Ant-Build-Matrix/./jdk=JDK%201.5%20(latest),label=Windows/ws/trunk\build\lib\ant-apache-bsf.jar>
     [exec] Building jar: <https://builds.apache.org/job/Ant-Build-Matrix/./jdk=JDK%201.5%20(latest),label=Windows/ws/trunk\build\lib\ant-javamail.jar>
     [exec] Building jar: <https://builds.apache.org/job/Ant-Build-Matrix/./jdk=JDK%201.5%20(latest),label=Windows/ws/trunk\build\lib\ant-netrexx.jar>
     [exec] Building jar: <https://builds.apache.org/job/Ant-Build-Matrix/./jdk=JDK%201.5%20(latest),label=Windows/ws/trunk\build\lib\ant-commons-net.jar>
     [exec] Building jar: <https://builds.apache.org/job/Ant-Build-Matrix/./jdk=JDK%201.5%20(latest),label=Windows/ws/trunk\build\lib\ant-antlr.jar>
     [exec] Building jar: <https://builds.apache.org/job/Ant-Build-Matrix/./jdk=JDK%201.5%20(latest),label=Windows/ws/trunk\build\lib\ant-jmf.jar>
     [exec] Building jar: <https://builds.apache.org/job/Ant-Build-Matrix/./jdk=JDK%201.5%20(latest),label=Windows/ws/trunk\build\lib\ant-jai.jar>
     [exec] Building jar: <https://builds.apache.org/job/Ant-Build-Matrix/./jdk=JDK%201.5%20(latest),label=Windows/ws/trunk\build\lib\ant-swing.jar>
     [exec] Building jar: <https://builds.apache.org/job/Ant-Build-Matrix/./jdk=JDK%201.5%20(latest),label=Windows/ws/trunk\build\lib\ant-jsch.jar>
     [exec] Building jar: <https://builds.apache.org/job/Ant-Build-Matrix/./jdk=JDK%201.5%20(latest),label=Windows/ws/trunk\build\lib\ant-jdepend.jar>
     [exec] Building jar: <https://builds.apache.org/job/Ant-Build-Matrix/./jdk=JDK%201.5%20(latest),label=Windows/ws/trunk\build\lib\ant-apache-xalan2.jar>
     [exec] 
     [exec] compile-tests:
     [exec] Created dir: <https://builds.apache.org/job/Ant-Build-Matrix/./jdk=JDK%201.5%20(latest),label=Windows/ws/trunk\build\testcases>
     [exec] Compiling 293 source files to <https://builds.apache.org/job/Ant-Build-Matrix/./jdk=JDK%201.5%20(latest),label=Windows/ws/trunk\build\testcases>
     [exec] <https://builds.apache.org/job/Ant-Build-Matrix/./jdk=JDK%201.5%20(latest),label=Windows/ws/trunk\src\tests\junit\org\apache\tools\ant\types\RedirectorElementTest.java>:35:
unexpected type
     [exec] found   : java.lang.Object
     [exec] required: reference
     [exec]         assertTrue((getProject().getReference("test1")
     [exec]                                              ^
     [exec] Note: Some input files use or override a deprecated API.
     [exec] Note: Recompile with -Xlint:deprecation for details.
     [exec] Note: Some input files use unchecked or unsafe operations.
     [exec] Note: Recompile with -Xlint:unchecked for details.
     [exec] 1 error
     [exec] 
     [exec] ... Cleaning Up Build Directories
     [exec] 
     [exec] BUILD FAILED
     [exec] <https://builds.apache.org/job/Ant-Build-Matrix/./jdk=JDK%201.5%20(latest),label=Windows/ws/trunk\build.xml>:1054:
The following error occurred while executing this line:
     [exec] <https://builds.apache.org/job/Ant-Build-Matrix/./jdk=JDK%201.5%20(latest),label=Windows/ws/trunk\build.xml>:1504:
Compile failed; see the compiler error output for details.
     [exec] 
     [exec] Total time: 11 seconds
     [exec] 
     [exec] ... Done Bootstrapping Ant Distribution
     [exec] Bootstrap FAILED

BUILD SUCCESSFUL
Total time: 22 seconds
Recording test results
No test report files were found. Configuration error?
Build step 'Publish JUnit test result report' changed build result to FAILURE

Mime
View raw message