ant-notifications mailing list archives

Site index · List index
Message view « Date » · « Thread »
Top « Date » · « Thread »
From Gump Integration Build <bode...@apache.org>
Subject [GUMP@vmgump]: Project svn-antlib-test (in module ant-antlibs) failed
Date Fri, 31 Aug 2012 01:27:18 GMT
To whom it may engage...
        
This is an automated request, but not an unsolicited one. For 
more information please visit http://gump.apache.org/nagged.html, 
and/or contact the folk at general@gump.apache.org.

Project svn-antlib-test has an issue affecting its community integration.
This issue affects 1 projects,
 and has been outstanding for 50 runs.
The current state of this project is 'Failed', with reason 'Build Failed'.
For reference only, the following projects are affected by this:
    - svn-antlib-test :  Task and Type Libraries for Apache Ant


Full details are available at:
    http://vmgump.apache.org/gump/public/ant-antlibs/svn-antlib-test/index.html

That said, some information snippets are provided here.

The following annotations (debug/informational/warning/error messages) were provided:
 -DEBUG- Dependency on ant-testutil exists, no need to add for property ant-testutil.jar.
 -INFO- Failed with reason build failed



The following work was performed:
http://vmgump.apache.org/gump/public/ant-antlibs/svn-antlib-test/gump_work/build_ant-antlibs_svn-antlib-test.html
Work Name: build_ant-antlibs_svn-antlib-test (Type: Build)
Work ended in a state of : Failed
Elapsed: 21 secs
Command Line: /usr/lib/jvm/java-7-oracle/bin/java -Djava.awt.headless=true -Dbuild.sysclasspath=only
-Xbootclasspath/p:/srv/gump/public/workspace/xml-xerces2/build/xercesImpl.jar:/srv/gump/public/workspace/xml-commons/java/external/build/xml-apis.jar
org.apache.tools.ant.Main -Dgump.merge=/srv/gump/public/gump/work/merge.xml -Dant-testutil.jar=/srv/gump/public/workspace/ant/build/lib/ant-testutil.jar
test 
[Working Directory: /srv/gump/public/workspace/ant-antlibs/svn]
CLASSPATH: /usr/lib/jvm/java-7-oracle/lib/tools.jar:/srv/gump/public/workspace/ant-antlibs/svn/build/test-classes:/srv/gump/public/workspace/ant/dist/lib/ant.jar:/srv/gump/public/workspace/ant/dist/lib/ant-launcher.jar:/srv/gump/public/workspace/ant/dist/lib/ant-jmf.jar:/srv/gump/public/workspace/ant/dist/lib/ant-junit.jar:/srv/gump/public/workspace/ant/dist/lib/ant-swing.jar:/srv/gump/public/workspace/ant/dist/lib/ant-apache-resolver.jar:/srv/gump/public/workspace/ant/dist/lib/ant-apache-xalan2.jar:/srv/gump/public/workspace/ant/build/lib/ant-testutil.jar:/srv/gump/public/workspace/junit/dist/junit-31082012.jar:/srv/gump/public/workspace/junit/dist/junit-dep-31082012.jar:/srv/gump/public/workspace/ant-antlibs/svn/build/ant-svn-31082012.jar:/srv/gump/public/workspace/xml-commons/java/external/build/xml-apis-ext.jar
---------------------------------------------
    [junit] junit.framework.AssertionFailedError: Expected to find revision 161885, but log
was <?xml version="1.0" encoding="UTF-8"?>
    [junit] <changelog>
    [junit] </changelog>
    [junit] 
    [junit] 	at junit.framework.Assert.fail(Assert.java:50)
    [junit] 	at junit.framework.Assert.assertTrue(Assert.java:20)
    [junit] 	at org.apache.ant.svn.SvnChangeLogTaskTest.assertRev161885(SvnChangeLogTaskTest.java:89)
    [junit] 	at org.apache.ant.svn.SvnChangeLogTaskTest.testStart(SvnChangeLogTaskTest.java:52)
    [junit] 	at sun.reflect.NativeMethodAccessorImpl.invoke0(Native Method)
    [junit] 	at sun.reflect.NativeMethodAccessorImpl.invoke(NativeMethodAccessorImpl.java:57)
    [junit] 	at sun.reflect.DelegatingMethodAccessorImpl.invoke(DelegatingMethodAccessorImpl.java:43)
    [junit] 	at java.lang.reflect.Method.invoke(Method.java:601)
    [junit] 	at junit.framework.TestCase.runTest(TestCase.java:168)
    [junit] 	at junit.framework.TestCase.runBare(TestCase.java:134)
    [junit] 	at junit.framework.TestResult$1.protect(TestResult.java:110)
    [junit] 	at junit.framework.TestResult.runProtected(TestResult.java:128)
    [junit] 	at junit.framework.TestResult.run(TestResult.java:113)
    [junit] 	at junit.framework.TestCase.run(TestCase.java:124)
    [junit] 	at junit.framework.TestSuite.runTest(TestSuite.java:244)
    [junit] 	at junit.framework.TestSuite.run(TestSuite.java:239)
    [junit] 	at org.apache.tools.ant.taskdefs.optional.junit.JUnitTestRunner.run(JUnitTestRunner.java:520)
    [junit] 	at org.apache.tools.ant.taskdefs.optional.junit.JUnitTestRunner.launch(JUnitTestRunner.java:1060)
    [junit] 	at org.apache.tools.ant.taskdefs.optional.junit.JUnitTestRunner.main(JUnitTestRunner.java:884)
    [junit] 
    [junit] TEST org.apache.ant.svn.SvnChangeLogTaskTest FAILED
    [junit] Testsuite: org.apache.ant.svn.SvnRevisionDiffTest
    [junit] Tests run: 2, Failures: 0, Errors: 0, Time elapsed: 2.07 sec
    [junit] 
    [junit] Testcase: testDiff took 1.41 sec
    [junit] Testcase: testDiffUrl took 0.658 sec
    [junit] Testsuite: org.apache.ant.svn.SvnTagDiffTest
    [junit] Tests run: 3, Failures: 0, Errors: 0, Time elapsed: 4.625 sec
    [junit] 
    [junit] Testcase: testDiffWithImplicitTrunk took 2.087 sec
    [junit] Testcase: testDiffWithTwoTags took 0.961 sec
    [junit] Testcase: testDiffWithExplicitTrunk took 1.577 sec
    [junit] Tests FAILED

setup-for-antunit-tests:

ready-to-test-with-antunit:

antunit-test:

test:

BUILD FAILED
/srv/gump/public/workspace/ant-antlibs/svn/common/build.xml:226: At least one JUnit test has
failed.

Total time: 21 seconds
---------------------------------------------

To subscribe to this information via syndicated feeds:
- RSS: http://vmgump.apache.org/gump/public/ant-antlibs/svn-antlib-test/rss.xml
- Atom: http://vmgump.apache.org/gump/public/ant-antlibs/svn-antlib-test/atom.xml

============================== Gump Tracking Only ===
Produced by Apache Gump(TM) version 2.3.
Gump Run 13000031082012, vmgump.apache.org:vmgump:13000031082012
Gump E-mail Identifier (unique within run) #14.

--
Apache Gump
http://gump.apache.org/ [Instance: vmgump]

Mime
View raw message