ant-notifications mailing list archives

Site index · List index
Message view « Date » · « Thread »
Top « Date » · « Thread »
From Apache Jenkins Server <jenk...@builds.apache.org>
Subject Build failed in Jenkins: Ant-Build-Matrix » JDK 1.5 (latest),Windows #515
Date Mon, 20 Aug 2012 19:27:10 GMT
See <https://builds.apache.org/job/Ant-Build-Matrix/./jdk=JDK%201.5%20(latest),label=Windows/515/changes>

Changes:

[mbenson] java 5 updates

[mbenson] Any FileResource whose represented File has a parent also has a basedir.

------------------------------------------
[...truncated 2408 lines...]
AU        manual\Tasks\antlr.html
AU        manual\Tasks\taskdef.html
AU        manual\Tasks\presetdef.html
AU        manual\Tasks\cvspass.html
AU        manual\Tasks\serverdeploy.html
AU        manual\Tasks\attrib.html
AU        manual\Tasks\javacc.html
AU        manual\Tasks\loadresource.html
AU        manual\Tasks\loadproperties.html
AU        manual\Tasks\parallel.html
AU        manual\Tasks\sshsession.html
AU        manual\Tasks\chgrp.html
AU        manual\Tasks\script.html
AU        manual\Tasks\sos.html
AU        manual\Tasks\retry.html
AU        manual\Tasks\bindtargets.html
AU        manual\Tasks\buildnumber.html
AU        manual\Tasks\whichresource.html
AU        manual\Tasks\schemavalidate.html
AU        manual\Tasks\sequential.html
AU        manual\Tasks\replace.html
AU        manual\Tasks\macrodef.html
AU        manual\Tasks\ant.html
AU        manual\Tasks\clearcase.html
AU        manual\Tasks\scriptdef.html
AU        manual\Tasks\javac.html
AU        manual\Tasks\truncate.html
AU        manual\Tasks\scp.html
AU        manual\Tasks\replaceregexp.html
AU        manual\Tasks\mimemail.html
AU        manual\Tasks\rpm.html
AU        manual\Tasks\sql.html
AU        manual\Tasks\jspc.html
AU        manual\Tasks\ccm.html
AU        manual\Tasks\jarlib-display.html
AU        manual\Tasks\mkdir.html
AU        manual\Tasks\javadoc.html
AU        manual\Tasks\BorlandEJBTasks.html
AU        manual\Tasks\gzip.html
AU        manual\Tasks\available.html
AU        manual\Tasks\length.html
AU        manual\Tasks\touch.html
AU        manual\Tasks\exec.html
AU        manual\Tasks\propertyhelper.html
AU        manual\Tasks\junitreport.html
AU        manual\Tasks\symlink.html
AU        manual\Tasks\untar.html
AU        manual\Tasks\javah.html
AU        manual\Tasks\cvs.html
AU        manual\Tasks\ejb.html
AU        manual\Tasks\wljspc.html
AU        manual\Tasks\recorder.html
AU        manual\Tasks\unzip.html
AU        manual\Tasks\rename.html
AU        manual\Tasks\jarlib-manifest.html
AU        manual\Tasks\diagnostics.html
AU        manual\Tasks\copydir.html
AU        manual\Tasks\xmlvalidate.html
AU        manual\Tasks\cvstagdiff.html
AU        manual\Tasks\image.html
AU        manual\Tasks\property.html
AU        manual\Tasks\condition.html
AU        manual\Tasks\changelog.html
AU        manual\Tasks\antversion.html
AU        manual\Tasks\hostinfo.html
AU        manual\Tasks\war.html
AU        manual\Tasks\splash.html
AU        manual\Tasks\local.html
AU        manual\Tasks\echoproperties.html
AU        manual\Tasks\depend.html
AU        manual\Tasks\netrexxc.html
AU        manual\Tasks\cvsversion.html
AU        manual\Tasks\sshexec.html
AU        manual\Tasks\tempfile.html
AU        manual\Tasks\move.html
AU        manual\Tasks\copy.html
AU        manual\feedback.html
AU        manual\anttaskslist.html
AU        manual\dirtasks.html
AU        manual\using.html
AU        manual\developlist.html
AU        manual\tutorial-writing-tasks-src.zip
AU        manual\favicon.ico
AU        manual\properties.html
AU        manual\tasklist.html
AU        manual\conceptstypeslist.html
A         manual\Types
AU        manual\Types\extension.html
AU        manual\Types\zipfileset.html
AU        manual\Types\classfileset.html
AU        manual\Types\description.html
AU        manual\Types\mapper.html
AU        manual\Types\extensionset.html
AU        manual\Types\filterchain.html
AU        manual\Types\patternset.html
AU        manual\Types\regexp.html
AU        manual\Types\assertions.html
AU        manual\Types\custom-programming.html
AU        manual\Types\dirset.html
AU        manual\Types\xmlcatalog.html
AU        manual\Types\fileset.html
AU        manual\Types\namespace.html
AU        manual\Types\propertyset.html
AU        manual\Types\filterset.html
AU        manual\Types\redirector.html
AU        manual\Types\tarfileset.html
AU        manual\Types\selectors.html
AU        manual\Types\selectors-program.html
AU        manual\Types\antlib.html
AU        manual\Types\resources.html
AU        manual\Types\permissions.html
AU        manual\Types\filelist.html
A         manual\images
AU        manual\images\ant_logo_large.gif
AU        manual\install.html
AU        manual\projecthelper.html
AU        manual\tutorial-writing-tasks.html
AU        manual\listeners.html
AU        manual\tasksoverview.html
AU        manual\runninglist.html
AU        manual\LICENSE
AU        manual\usinglist.html
AU        manual\platform.html
AU        manual\toc.html
AU        manual\antexternal.html
AU        manual\tutorials.html
AU        manual\tutorial-tasks-filesets-properties.zip
AU        manual\intro.html
AU        manual\tutorial-tasks-filesets-properties.html
AU        manual\inputhandler.html
AU        manual\credits.html
AU        manual\develop.html
AU        manual\ide.html
AU        manual\installlist.html
AU        manual\clonevm.html
A         manual\api
AU        manual\api\index.html
AU        manual\index.html
AU        manual\javacprops.html
AU        manual\base_task_classes.html
A         manual\stylesheets
AU        manual\stylesheets\antmanual.css
AU        manual\stylesheets\style.css
AU        manual\targets.html
AU        manual\tutorial-HelloWorldWithAnt.html
 U        .
At revision 1375150
[trunk] $ cmd.exe /C '"f:\hudson\hudson-slave\tools\Ant\ant-1.8.2\bin\ant.bat -file launch-build.xml
-Dlabel=Windows "-Djdk=JDK 1.5 (latest)" "-Dargs=allclean test -Dignore.tests.failed=true
-Doptional.jars.whenmanifestonly=skip" && exit %%ERRORLEVEL%%"'
Buildfile: <https://builds.apache.org/job/Ant-Build-Matrix/./jdk=JDK%201.5%20(latest),label=Windows/ws/trunk\launch-build.xml>

launch:
     [echo] Launching build.bat allclean test -Dignore.tests.failed=true -Doptional.jars.whenmanifestonly=skip
     [exec] The command attribute is deprecated.
     [exec] Please use the executable attribute and nested arg elements.
     [exec] 
     [exec] ... Bootstrapping Ant Distribution
     [exec] JAVA_HOME=f:\hudson\tools\java\latest-1.5-64
     [exec] JAVA=f:\hudson\tools\java\latest-1.5-64\bin\java
     [exec] JAVAC=f:\hudson\tools\java\latest-1.5-64\bin\javac
     [exec] CLASSPATH=;lib\optional\ant-antunit-1.2.jar;lib\optional\junit-3.8.2.jar;lib\optional\junit-4.8.1.jar;f:\hudson\tools\java\latest-1.5-64\lib\tools.jar;build\classes;src\main;
     [exec] 
     [exec] ... Compiling Ant Classes
     [exec] Note: Some input files use or override a deprecated API.
     [exec] Note: Recompile with -Xlint:deprecation for details.
     [exec] Note: Some input files use unchecked or unsafe operations.
     [exec] Note: Recompile with -Xlint:unchecked for details.
     [exec] 
     [exec] ... Copying Required Files
     [exec] src\main\org\apache\tools\ant\taskdefs\defaults.properties
     [exec]         1 file(s) copied.
     [exec] src\main\org\apache\tools\ant\types\defaults.properties
     [exec]         1 file(s) copied.
     [exec] 
     [exec] ... Building Ant Distribution
     [exec] Buildfile: <https://builds.apache.org/job/Ant-Build-Matrix/./jdk=JDK%201.5%20(latest),label=Windows/ws/trunk\build.xml>
     [exec] 
     [exec] bootstrap:
     [exec] 
     [exec] prepare:
     [exec] 
     [exec] check_for_optional_packages:
     [exec] 
     [exec] build:
     [exec] Created dir: <https://builds.apache.org/job/Ant-Build-Matrix/./jdk=JDK%201.5%20(latest),label=Windows/ws/trunk\build\lib>
     [exec] Compiling 252 source files to <https://builds.apache.org/job/Ant-Build-Matrix/./jdk=JDK%201.5%20(latest),label=Windows/ws/trunk\build\classes>
     [exec] Note: Some input files use or override a deprecated API.
     [exec] Note: Recompile with -Xlint:deprecation for details.
     [exec] Note: Some input files use unchecked or unsafe operations.
     [exec] Note: Recompile with -Xlint:unchecked for details.
     [exec] Copying 5 files to <https://builds.apache.org/job/Ant-Build-Matrix/./jdk=JDK%201.5%20(latest),label=Windows/ws/trunk\build\classes>
     [exec] Copying 2 files to <https://builds.apache.org/job/Ant-Build-Matrix/./jdk=JDK%201.5%20(latest),label=Windows/ws/trunk\build\classes>
     [exec] Copying 2 files to <https://builds.apache.org/job/Ant-Build-Matrix/./jdk=JDK%201.5%20(latest),label=Windows/ws/trunk\build\classes\org\apache\tools\ant\taskdefs\optional\junit\xsl>
     [exec] 
     [exec] jars:
     [exec] Copying 2 files to <https://builds.apache.org/job/Ant-Build-Matrix/./jdk=JDK%201.5%20(latest),label=Windows/ws/trunk\build>
     [exec] Copying 1 file to <https://builds.apache.org/job/Ant-Build-Matrix/./jdk=JDK%201.5%20(latest),label=Windows/ws/trunk\build>
     [exec] Building jar: <https://builds.apache.org/job/Ant-Build-Matrix/./jdk=JDK%201.5%20(latest),label=Windows/ws/trunk\build\lib\ant-launcher.jar>
     [exec] Building jar: <https://builds.apache.org/job/Ant-Build-Matrix/./jdk=JDK%201.5%20(latest),label=Windows/ws/trunk\build\lib\ant.jar>
     [exec] Building jar: <https://builds.apache.org/job/Ant-Build-Matrix/./jdk=JDK%201.5%20(latest),label=Windows/ws/trunk\build\lib\ant-bootstrap.jar>
     [exec] Building jar: <https://builds.apache.org/job/Ant-Build-Matrix/./jdk=JDK%201.5%20(latest),label=Windows/ws/trunk\build\lib\ant-apache-resolver.jar>
     [exec] Building jar: <https://builds.apache.org/job/Ant-Build-Matrix/./jdk=JDK%201.5%20(latest),label=Windows/ws/trunk\build\lib\ant-junit.jar>
     [exec] Building jar: <https://builds.apache.org/job/Ant-Build-Matrix/./jdk=JDK%201.5%20(latest),label=Windows/ws/trunk\build\lib\ant-junit4.jar>
     [exec] Building jar: <https://builds.apache.org/job/Ant-Build-Matrix/./jdk=JDK%201.5%20(latest),label=Windows/ws/trunk\build\lib\ant-apache-regexp.jar>
     [exec] Building jar: <https://builds.apache.org/job/Ant-Build-Matrix/./jdk=JDK%201.5%20(latest),label=Windows/ws/trunk\build\lib\ant-apache-oro.jar>
     [exec] Building jar: <https://builds.apache.org/job/Ant-Build-Matrix/./jdk=JDK%201.5%20(latest),label=Windows/ws/trunk\build\lib\ant-apache-bcel.jar>
     [exec] Building jar: <https://builds.apache.org/job/Ant-Build-Matrix/./jdk=JDK%201.5%20(latest),label=Windows/ws/trunk\build\lib\ant-apache-log4j.jar>
     [exec] Building jar: <https://builds.apache.org/job/Ant-Build-Matrix/./jdk=JDK%201.5%20(latest),label=Windows/ws/trunk\build\lib\ant-commons-logging.jar>
     [exec] Building jar: <https://builds.apache.org/job/Ant-Build-Matrix/./jdk=JDK%201.5%20(latest),label=Windows/ws/trunk\build\lib\ant-apache-bsf.jar>
     [exec] Building jar: <https://builds.apache.org/job/Ant-Build-Matrix/./jdk=JDK%201.5%20(latest),label=Windows/ws/trunk\build\lib\ant-javamail.jar>
     [exec] Building jar: <https://builds.apache.org/job/Ant-Build-Matrix/./jdk=JDK%201.5%20(latest),label=Windows/ws/trunk\build\lib\ant-netrexx.jar>
     [exec] Building jar: <https://builds.apache.org/job/Ant-Build-Matrix/./jdk=JDK%201.5%20(latest),label=Windows/ws/trunk\build\lib\ant-commons-net.jar>
     [exec] Building jar: <https://builds.apache.org/job/Ant-Build-Matrix/./jdk=JDK%201.5%20(latest),label=Windows/ws/trunk\build\lib\ant-antlr.jar>
     [exec] Building jar: <https://builds.apache.org/job/Ant-Build-Matrix/./jdk=JDK%201.5%20(latest),label=Windows/ws/trunk\build\lib\ant-jmf.jar>
     [exec] Building jar: <https://builds.apache.org/job/Ant-Build-Matrix/./jdk=JDK%201.5%20(latest),label=Windows/ws/trunk\build\lib\ant-jai.jar>
     [exec] Building jar: <https://builds.apache.org/job/Ant-Build-Matrix/./jdk=JDK%201.5%20(latest),label=Windows/ws/trunk\build\lib\ant-swing.jar>
     [exec] Building jar: <https://builds.apache.org/job/Ant-Build-Matrix/./jdk=JDK%201.5%20(latest),label=Windows/ws/trunk\build\lib\ant-jsch.jar>
     [exec] Building jar: <https://builds.apache.org/job/Ant-Build-Matrix/./jdk=JDK%201.5%20(latest),label=Windows/ws/trunk\build\lib\ant-jdepend.jar>
     [exec] Building jar: <https://builds.apache.org/job/Ant-Build-Matrix/./jdk=JDK%201.5%20(latest),label=Windows/ws/trunk\build\lib\ant-apache-xalan2.jar>
     [exec] 
     [exec] compile-tests:
     [exec] Created dir: <https://builds.apache.org/job/Ant-Build-Matrix/./jdk=JDK%201.5%20(latest),label=Windows/ws/trunk\build\testcases>
     [exec] Compiling 293 source files to <https://builds.apache.org/job/Ant-Build-Matrix/./jdk=JDK%201.5%20(latest),label=Windows/ws/trunk\build\testcases>
     [exec] <https://builds.apache.org/job/Ant-Build-Matrix/./jdk=JDK%201.5%20(latest),label=Windows/ws/trunk\src\tests\junit\org\apache\tools\ant\types\RedirectorElementTest.java>:35:
unexpected type
     [exec] found   : java.lang.Object
     [exec] required: reference
     [exec]         assertTrue((getProject().getReference("test1")
     [exec]                                              ^
     [exec] Note: Some input files use or override a deprecated API.
     [exec] Note: Recompile with -Xlint:deprecation for details.
     [exec] Note: Some input files use unchecked or unsafe operations.
     [exec] Note: Recompile with -Xlint:unchecked for details.
     [exec] BUILD FAILED
     [exec] <https://builds.apache.org/job/Ant-Build-Matrix/./jdk=JDK%201.5%20(latest),label=Windows/ws/trunk\build.xml>:1054:
The following error occurred while executing this line:
     [exec] <https://builds.apache.org/job/Ant-Build-Matrix/./jdk=JDK%201.5%20(latest),label=Windows/ws/trunk\build.xml>:1504:
Compile failed; see the compiler error output for details.
     [exec] 
     [exec] Total time: 10 seconds
     [exec] 
     [exec] 1 error
     [exec] 
     [exec] ... Cleaning Up Build Directories
     [exec] 
     [exec] ... Done Bootstrapping Ant Distribution
     [exec] Bootstrap FAILED

BUILD SUCCESSFUL
Total time: 20 seconds
Recording test results
No test report files were found. Configuration error?
Build step 'Publish JUnit test result report' changed build result to FAILURE

Mime
View raw message