ant-notifications mailing list archives

Site index · List index
Message view « Date » · « Thread »
Top « Date » · « Thread »
From Apache Jenkins Server <jenk...@builds.apache.org>
Subject Build failed in Jenkins: Ivy-tests #138
Date Sun, 19 Aug 2012 23:09:36 GMT
See <https://builds.apache.org/job/Ivy-tests/138/changes>

Changes:

[maartenc] FIX: Maven 'hk2-jar' packaging is now supported (IVY-1357)

[hibou] When catching an exception, and the stacktrace might be miningful (actually hightly
valuable for a NPE), log the stack trace in debug.

------------------------------------------
[...truncated 290 lines...]
    [junit] Running org.apache.ivy.IvyTest
    [junit] Tests run: 1, Failures: 0, Errors: 0, Time elapsed: 3,221 sec
    [junit] Running org.apache.ivy.MainTest
    [junit] Tests run: 9, Failures: 0, Errors: 0, Time elapsed: 0,956 sec
    [junit] Running org.apache.ivy.ant.AntBuildTriggerTest
    [junit] Tests run: 1, Failures: 0, Errors: 0, Time elapsed: 8,542 sec
    [junit] Running org.apache.ivy.ant.AntCallTriggerTest
    [junit] Tests run: 1, Failures: 0, Errors: 0, Time elapsed: 9,59 sec
    [junit] Running org.apache.ivy.ant.FixDepsTaskTest
    [junit] Tests run: 4, Failures: 0, Errors: 0, Time elapsed: 1,315 sec
    [junit] Running org.apache.ivy.ant.IvyAntSettingsBuildFileTest
    [junit] Tests run: 5, Failures: 0, Errors: 0, Time elapsed: 1,346 sec
    [junit] Running org.apache.ivy.ant.IvyArtifactPropertyTest
    [junit] Tests run: 3, Failures: 0, Errors: 0, Time elapsed: 1,109 sec
    [junit] Running org.apache.ivy.ant.IvyArtifactReportTest
    [junit] Tests run: 1, Failures: 0, Errors: 0, Time elapsed: 0,838 sec
    [junit] Running org.apache.ivy.ant.IvyBuildListTest
    [junit] Tests run: 21, Failures: 3, Errors: 0, Time elapsed: 4,327 sec
    [junit] Test org.apache.ivy.ant.IvyBuildListTest FAILED
    [junit] Running org.apache.ivy.ant.IvyBuildNumberTest
    [junit] Tests run: 12, Failures: 0, Errors: 0, Time elapsed: 0,768 sec
    [junit] Running org.apache.ivy.ant.IvyCacheFilesetTest
    [junit] Tests run: 7, Failures: 0, Errors: 0, Time elapsed: 1,102 sec
    [junit] Running org.apache.ivy.ant.IvyCachePathTest
    [junit] Tests run: 9, Failures: 0, Errors: 0, Time elapsed: 1,561 sec
    [junit] Running org.apache.ivy.ant.IvyCleanCacheTest
    [junit] Tests run: 5, Failures: 0, Errors: 0, Time elapsed: 0,473 sec
    [junit] Running org.apache.ivy.ant.IvyConfigureTest
    [junit] Tests run: 13, Failures: 0, Errors: 0, Time elapsed: 0,75 sec
    [junit] Running org.apache.ivy.ant.IvyConvertPomTest
    [junit] Tests run: 1, Failures: 0, Errors: 0, Time elapsed: 4,656 sec
    [junit] Running org.apache.ivy.ant.IvyDeliverTest
    [junit] Tests run: 15, Failures: 0, Errors: 0, Time elapsed: 12,311 sec
    [junit] Running org.apache.ivy.ant.IvyFindRevisionTest
    [junit] Tests run: 3, Failures: 0, Errors: 0, Time elapsed: 0,671 sec
    [junit] Running org.apache.ivy.ant.IvyInfoRepositoryTest
    [junit] Tests run: 3, Failures: 0, Errors: 0, Time elapsed: 0,67 sec
    [junit] Running org.apache.ivy.ant.IvyInfoTest
    [junit] Tests run: 4, Failures: 0, Errors: 0, Time elapsed: 0,882 sec
    [junit] Running org.apache.ivy.ant.IvyInstallTest
    [junit] Tests run: 14, Failures: 0, Errors: 0, Time elapsed: 2,32 sec
    [junit] Running org.apache.ivy.ant.IvyListModulesTest
    [junit] Tests run: 2, Failures: 0, Errors: 0, Time elapsed: 0,539 sec
    [junit] Running org.apache.ivy.ant.IvyPostResolveTaskTest
    [junit] Tests run: 13, Failures: 0, Errors: 0, Time elapsed: 1,85 sec
    [junit] Running org.apache.ivy.ant.IvyPublishTest
    [junit] Tests run: 21, Failures: 0, Errors: 0, Time elapsed: 2,958 sec
    [junit] Running org.apache.ivy.ant.IvyReportTest
    [junit] Tests run: 6, Failures: 0, Errors: 0, Time elapsed: 2,105 sec
    [junit] Running org.apache.ivy.ant.IvyRepositoryReportTest
    [junit] Tests run: 3, Failures: 0, Errors: 0, Time elapsed: 1,195 sec
    [junit] Running org.apache.ivy.ant.IvyResolveTest
    [junit] Tests run: 32, Failures: 0, Errors: 0, Time elapsed: 6,064 sec
    [junit] Running org.apache.ivy.ant.IvyResourcesTest
    [junit] Tests run: 8, Failures: 0, Errors: 0, Time elapsed: 1,564 sec
    [junit] Running org.apache.ivy.ant.IvyRetrieveBuildFileTest
    [junit] Tests run: 1, Failures: 0, Errors: 0, Time elapsed: 0,774 sec
    [junit] Running org.apache.ivy.ant.IvyRetrieveTest
    [junit] Tests run: 19, Failures: 0, Errors: 0, Time elapsed: 2,178 sec
    [junit] Running org.apache.ivy.ant.IvyTaskTest
    [junit] Tests run: 3, Failures: 0, Errors: 0, Time elapsed: 0,493 sec
    [junit] Running org.apache.ivy.ant.IvyVarTest
    [junit] Tests run: 4, Failures: 0, Errors: 0, Time elapsed: 0,566 sec
    [junit] Running org.apache.ivy.core.NormalRelativeUrlResolverTest
    [junit] Tests run: 7, Failures: 0, Errors: 0, Time elapsed: 1,015 sec
    [junit] Running org.apache.ivy.core.cache.DefaultRepositoryCacheManagerTest
    [junit] Tests run: 2, Failures: 0, Errors: 0, Time elapsed: 0,607 sec
    [junit] Running org.apache.ivy.core.cache.ModuleDescriptorMemoryCacheTest
    [junit] Tests run: 10, Failures: 0, Errors: 0, Time elapsed: 0,068 sec
    [junit] Running org.apache.ivy.core.deliver.DeliverTest
    [junit] Tests run: 1, Failures: 0, Errors: 0, Time elapsed: 1,041 sec
    [junit] Running org.apache.ivy.core.event.IvyEventFilterTest
    [junit] Tests run: 5, Failures: 0, Errors: 0, Time elapsed: 0,433 sec
    [junit] Running org.apache.ivy.core.install.InstallTest
    [junit] Tests run: 9, Failures: 0, Errors: 0, Time elapsed: 6,072 sec
    [junit] Running org.apache.ivy.core.module.descriptor.DefaultDependencyDescriptorTest
    [junit] Tests run: 2, Failures: 0, Errors: 0, Time elapsed: 0,206 sec
    [junit] Running org.apache.ivy.core.module.id.ModuleIdTest
    [junit] Tests run: 11, Failures: 0, Errors: 0, Time elapsed: 0,209 sec
    [junit] Running org.apache.ivy.core.module.id.ModuleRevisionIdTest
    [junit] Tests run: 2, Failures: 0, Errors: 0, Time elapsed: 0,209 sec
    [junit] Running org.apache.ivy.core.module.id.ModuleRulesTest
    [junit] Tests run: 2, Failures: 0, Errors: 0, Time elapsed: 0,213 sec
    [junit] Running org.apache.ivy.core.publish.PublishEngineTest
    [junit] Tests run: 1, Failures: 0, Errors: 0, Time elapsed: 0,839 sec
    [junit] Running org.apache.ivy.core.publish.PublishEventsTest
    [junit] Tests run: 4, Failures: 0, Errors: 0, Time elapsed: 4,849 sec
    [junit] Running org.apache.ivy.core.repository.RepositoryManagementEngineTest
    [junit] Tests run: 2, Failures: 0, Errors: 0, Time elapsed: 6,493 sec
    [junit] Running org.apache.ivy.core.resolve.ResolveEngineTest
    [junit] Tests run: 2, Failures: 0, Errors: 0, Time elapsed: 0,537 sec
    [junit] Running org.apache.ivy.core.resolve.ResolveTest
    [junit] Tests run: 222, Failures: 0, Errors: 0, Time elapsed: 21,55 sec
    [junit] Running org.apache.ivy.core.retrieve.RetrieveTest
    [junit] Tests run: 9, Failures: 0, Errors: 0, Time elapsed: 1,454 sec
    [junit] Running org.apache.ivy.core.search.SearchTest
    [junit] Tests run: 3, Failures: 0, Errors: 0, Time elapsed: 0,433 sec
    [junit] Running org.apache.ivy.core.settings.ConfigureTest
    [junit] Tests run: 4, Failures: 0, Errors: 0, Time elapsed: 0,477 sec
    [junit] Running org.apache.ivy.core.settings.IvySettingsTest
    [junit] Tests run: 2, Failures: 0, Errors: 0, Time elapsed: 0,432 sec
    [junit] Running org.apache.ivy.core.settings.OnlineXmlSettingsParserTest
    [junit] Tests run: 4, Failures: 0, Errors: 0, Time elapsed: 4,627 sec
    [junit] Running org.apache.ivy.core.settings.XmlSettingsParserTest
    [junit] Tests run: 25, Failures: 0, Errors: 0, Time elapsed: 0,648 sec
    [junit] Running org.apache.ivy.core.sort.SortTest
    [junit] Tests run: 8, Failures: 0, Errors: 0, Time elapsed: 0,463 sec
    [junit] Running org.apache.ivy.osgi.core.ExecutionEnvironmentProfileLoaderTest
    [junit] Tests run: 1, Failures: 0, Errors: 0, Time elapsed: 0,249 sec
    [junit] Running org.apache.ivy.osgi.core.ManifestHeaderTest
    [junit] Tests run: 4, Failures: 0, Errors: 0, Time elapsed: 0,207 sec
    [junit] Running org.apache.ivy.osgi.core.ManifestParserTest
    [junit] Tests run: 2, Failures: 0, Errors: 0, Time elapsed: 0,216 sec
    [junit] Running org.apache.ivy.osgi.core.OsgiLatestStrategyTest
    [junit] Tests run: 3, Failures: 0, Errors: 0, Time elapsed: 0,447 sec
    [junit] Running org.apache.ivy.osgi.obr.OBRParserTest
    [junit] Tests run: 2, Failures: 0, Errors: 0, Time elapsed: 6,037 sec
    [junit] Running org.apache.ivy.osgi.obr.OBRResolverTest
    [junit] Tests run: 15, Failures: 0, Errors: 0, Time elapsed: 1,078 sec
    [junit] Running org.apache.ivy.osgi.obr.RequirementFilterTest
    [junit] Tests run: 1, Failures: 0, Errors: 0, Time elapsed: 0,198 sec
    [junit] Running org.apache.ivy.osgi.p2.P2DescriptorTest
    [junit] Tests run: 1, Failures: 0, Errors: 0, Time elapsed: 0,652 sec
    [junit] Running org.apache.ivy.osgi.repo.BundleRepoTest
    [junit] Tests run: 4, Failures: 0, Errors: 0, Time elapsed: 1,225 sec
    [junit] Running org.apache.ivy.osgi.updatesite.UpdateSiteAndIbiblioResolverTest
    [junit] Tests run: 1, Failures: 0, Errors: 0, Time elapsed: 0,859 sec
    [junit] Running org.apache.ivy.osgi.updatesite.UpdateSiteLoaderTest
    [junit] Tests run: 3, Failures: 0, Errors: 0, Time elapsed: 33,717 sec
    [junit] Running org.apache.ivy.osgi.updatesite.UpdateSiteResolverTest
    [junit] Tests run: 3, Failures: 0, Errors: 0, Time elapsed: 0,834 sec
    [junit] Running org.apache.ivy.osgi.util.ParseUtilTest
    [junit] Tests run: 1, Failures: 0, Errors: 0, Time elapsed: 0,199 sec
    [junit] Running org.apache.ivy.osgi.util.VersionRangeTest
    [junit] Tests run: 2, Failures: 0, Errors: 0, Time elapsed: 0,204 sec
    [junit] Running org.apache.ivy.osgi.util.VersionTest
    [junit] Tests run: 2, Failures: 0, Errors: 0, Time elapsed: 0,204 sec
    [junit] Running org.apache.ivy.plugins.circular.IgnoreCircularDependencyStrategyTest
    [junit] Tests run: 2, Failures: 0, Errors: 0, Time elapsed: 0,217 sec
    [junit] Running org.apache.ivy.plugins.circular.WarnCircularDependencyStrategyTest
    [junit] Tests run: 3, Failures: 0, Errors: 0, Time elapsed: 0,288 sec
    [junit] Running org.apache.ivy.plugins.conflict.LatestCompatibleConflictManagerTest
    [junit] Tests run: 12, Failures: 0, Errors: 0, Time elapsed: 2,701 sec
    [junit] Running org.apache.ivy.plugins.conflict.LatestConflictManagerTest
    [junit] Tests run: 5, Failures: 0, Errors: 0, Time elapsed: 0,957 sec
    [junit] Running org.apache.ivy.plugins.conflict.RegexpConflictManagerTest
    [junit] Tests run: 2, Failures: 0, Errors: 0, Time elapsed: 0,56 sec
    [junit] Running org.apache.ivy.plugins.conflict.StrictConflictManagerTest
    [junit] Tests run: 5, Failures: 0, Errors: 0, Time elapsed: 0,716 sec
    [junit] Running org.apache.ivy.plugins.latest.LatestRevisionStrategyTest
    [junit] Tests run: 4, Failures: 0, Errors: 0, Time elapsed: 0,462 sec
    [junit] Running org.apache.ivy.plugins.lock.ArtifactLockStrategyTest
    [junit] Tests run: 1, Failures: 0, Errors: 0, Time elapsed: 5,113 sec
    [junit] Running org.apache.ivy.plugins.matcher.ExactOrRegexpPatternMatcherTest
    [junit] Tests run: 7, Failures: 0, Errors: 0, Time elapsed: 0,49 sec
    [junit] Running org.apache.ivy.plugins.matcher.ExactPatternMatcherTest
    [junit] Tests run: 7, Failures: 0, Errors: 0, Time elapsed: 0,217 sec
    [junit] Running org.apache.ivy.plugins.matcher.GlobPatternMatcherTest
    [junit] Tests run: 13, Failures: 0, Errors: 0, Time elapsed: 0,848 sec
    [junit] Running org.apache.ivy.plugins.matcher.RegexpPatternMatcherTest
    [junit] Tests run: 7, Failures: 0, Errors: 0, Time elapsed: 0,487 sec
    [junit] Running org.apache.ivy.plugins.namespace.MRIDTransformationRuleTest
    [junit] Tests run: 1, Failures: 0, Errors: 0, Time elapsed: 0,227 sec
    [junit] Running org.apache.ivy.plugins.namespace.NameSpaceHelperTest
    [junit] Tests run: 1, Failures: 0, Errors: 0, Time elapsed: 0,213 sec
    [junit] Running org.apache.ivy.plugins.parser.ModuleDescriptorParserRegistryTest
    [junit] Tests run: 1, Failures: 0, Errors: 0, Time elapsed: 0,432 sec
    [junit] Running org.apache.ivy.plugins.parser.m2.PomModuleDescriptorParserTest
    [junit] Tests run: 39, Failures: 0, Errors: 0, Time elapsed: 1,13 sec
    [junit] Running org.apache.ivy.plugins.parser.m2.PomModuleDescriptorWriterTest
    [junit] Tests run: 11, Failures: 0, Errors: 0, Time elapsed: 0,708 sec
    [junit] Running org.apache.ivy.plugins.parser.xml.XmlModuleDescriptorParserTest
    [junit] Tests run: 40, Failures: 0, Errors: 6, Time elapsed: 1,69 sec
    [junit] Test org.apache.ivy.plugins.parser.xml.XmlModuleDescriptorParserTest FAILED
    [junit] Running org.apache.ivy.plugins.parser.xml.XmlModuleDescriptorWriterTest
    [junit] Tests run: 7, Failures: 0, Errors: 1, Time elapsed: 0,766 sec
    [junit] Test org.apache.ivy.plugins.parser.xml.XmlModuleDescriptorWriterTest FAILED
    [junit] Running org.apache.ivy.plugins.parser.xml.XmlModuleUpdaterTest
    [junit] Tests run: 9, Failures: 0, Errors: 0, Time elapsed: 0,874 sec
    [junit] Running org.apache.ivy.plugins.report.XmlReportParserTest
    [junit] Tests run: 1, Failures: 0, Errors: 0, Time elapsed: 0,506 sec
    [junit] Running org.apache.ivy.plugins.report.XmlReportWriterTest
    [junit] Tests run: 3, Failures: 0, Errors: 0, Time elapsed: 1,001 sec
    [junit] Running org.apache.ivy.plugins.repository.vfs.VfsRepositoryTest
    [junit] Tests run: 7, Failures: 0, Errors: 0, Time elapsed: 0,73 sec
    [junit] Running org.apache.ivy.plugins.repository.vfs.VfsResourceTest
    [junit] Tests run: 6, Failures: 0, Errors: 0, Time elapsed: 0,585 sec
    [junit] Running org.apache.ivy.plugins.resolver.ChainResolverTest
    [junit] Tests run: 15, Failures: 0, Errors: 0, Time elapsed: 0,855 sec
    [junit] Running org.apache.ivy.plugins.resolver.DualResolverTest
    [junit] Tests run: 6, Failures: 0, Errors: 0, Time elapsed: 0,455 sec
    [junit] Running org.apache.ivy.plugins.resolver.FileSystemResolverTest
    [junit] Tests run: 25, Failures: 0, Errors: 0, Time elapsed: 2,468 sec
    [junit] Running org.apache.ivy.plugins.resolver.IBiblioResolverTest
    [junit] Tests run: 7, Failures: 0, Errors: 0, Time elapsed: 2,765 sec
    [junit] Running org.apache.ivy.plugins.resolver.IvyRepResolverTest
    [junit] Tests run: 3, Failures: 0, Errors: 0, Time elapsed: 0,757 sec
    [junit] Running org.apache.ivy.plugins.resolver.JarResolverTest
    [junit] Tests run: 3, Failures: 0, Errors: 0, Time elapsed: 0,832 sec
    [junit] Running org.apache.ivy.plugins.resolver.Maven2LocalTest
    [junit] Tests run: 2, Failures: 0, Errors: 0, Time elapsed: 0,633 sec
    [junit] Running org.apache.ivy.plugins.resolver.MirroredURLResolverTest
    [junit] Tests run: 3, Failures: 0, Errors: 0, Time elapsed: 0,989 sec
    [junit] Running org.apache.ivy.plugins.resolver.PackagerResolverTest
    [junit] Tests run: 3, Failures: 0, Errors: 0, Time elapsed: 1,812 sec
    [junit] Running org.apache.ivy.plugins.resolver.URLResolverTest
    [junit] Tests run: 9, Failures: 0, Errors: 0, Time elapsed: 2,144 sec
    [junit] Running org.apache.ivy.plugins.resolver.VfsResolverTest
    [junit] Tests run: 2, Failures: 0, Errors: 0, Time elapsed: 0,224 sec
    [junit] Running org.apache.ivy.plugins.resolver.util.ResolverHelperTest
    [junit] Tests run: 1, Failures: 0, Errors: 0, Time elapsed: 0,214 sec
    [junit] Running org.apache.ivy.plugins.trigger.LogTriggerTest
    [junit] Tests run: 3, Failures: 0, Errors: 0, Time elapsed: 0,425 sec
    [junit] Running org.apache.ivy.plugins.version.LatestVersionMatcherTest
    [junit] Tests run: 2, Failures: 0, Errors: 0, Time elapsed: 0,44 sec
    [junit] Running org.apache.ivy.plugins.version.PatternVersionMatcherTest
    [junit] Tests run: 3, Failures: 0, Errors: 0, Time elapsed: 0,414 sec
    [junit] Running org.apache.ivy.plugins.version.VersionRangeMatcherTest
    [junit] Tests run: 6, Failures: 0, Errors: 0, Time elapsed: 0,446 sec
    [junit] Running org.apache.ivy.util.ConfiguratorTest
    [junit] Tests run: 13, Failures: 0, Errors: 0, Time elapsed: 0,229 sec
    [junit] Running org.apache.ivy.util.IvyPatternHelperTest
    [junit] Tests run: 7, Failures: 0, Errors: 0, Time elapsed: 0,208 sec
    [junit] Running org.apache.ivy.util.StringUtilsTest
    [junit] Tests run: 2, Failures: 0, Errors: 1, Time elapsed: 0,205 sec
    [junit] Test org.apache.ivy.util.StringUtilsTest FAILED
    [junit] Running org.apache.ivy.util.url.ApacheURLListerTest
    [junit] Tests run: 6, Failures: 0, Errors: 0, Time elapsed: 0,322 sec
    [junit] Running org.apache.ivy.util.url.ArtifactoryListingTest
    [junit] Tests run: 1, Failures: 0, Errors: 0, Time elapsed: 0,759 sec
    [junit] Running org.apache.ivy.util.url.BasicURLHandlerTest
    [junit] Tests run: 2, Failures: 0, Errors: 0, Time elapsed: 4,287 sec
    [junit] Running org.apache.ivy.util.url.HttpclientURLHandlerTest
    [junit] Tests run: 3, Failures: 0, Errors: 0, Time elapsed: 2,871 sec

test-report:
[junitreport] Processing <https://builds.apache.org/job/Ivy-tests/ws/trunk/build/test-report/TESTS-TestSuites.xml>
to /tmp/null1002950425
[junitreport] Loading stylesheet jar:file:/home/hudson/tools/ant/apache-ant-1.7.0/lib/ant-junit.jar!/org/apache/tools/ant/taskdefs/optional/junit/xsl/junit-frames.xsl
[junitreport] Transform time: 14721ms
[junitreport] Deleting: /tmp/null1002950425

BUILD FAILED
<https://builds.apache.org/job/Ivy-tests/ws/trunk/build.xml>:497: At least one test
has failed. See logs (in <https://builds.apache.org/job/Ivy-tests/ws/trunk/build/test-report)>
or report (in <https://builds.apache.org/job/Ivy-tests/ws/trunk/build/doc/reports/test)>

Total time: 4 minutes 49 seconds
Build step 'Invoke Ant' marked build as failure
[locks-and-latches] Releasing all the locks
[locks-and-latches] All the locks released
Recording test results

Mime
View raw message