ant-notifications mailing list archives

Site index · List index
Message view « Date » · « Thread »
Top « Date » · « Thread »
From Apache Jenkins Server <jenk...@builds.apache.org>
Subject Build failed in Jenkins: Ant-Build-Matrix » JDK 1.5 (latest),Windows #483
Date Mon, 21 May 2012 05:01:14 GMT
See <https://builds.apache.org/job/Ant-Build-Matrix/./jdk=JDK%201.5%20(latest),label=Windows/483/>

------------------------------------------
Started by upstream project "Ant-Build-Matrix" build number 483
Building remotely on windows1 in workspace <https://builds.apache.org/job/Ant-Build-Matrix/./jdk=JDK%201.5%20(latest),label=Windows/ws/>
Checking out a fresh workspace because F:\hudson\hudson-slave\workspace\Ant-Build-Matrix\jdk\JDK
1.5 (latest)\label\Windows\trunk doesn't exist
Cleaning local Directory trunk
Checking out http://svn.apache.org/repos/asf/ant/core/trunk
A         release
AU        release\upload.xml
AU        release\ivy.xml
AU        release\ivysettings.xml
AU        release\signit.xml
AU        NOTICE
AU        LICENSE
AU        bootstrap.bat
AU        STATUS
AU        bootstrap.sh
A         src
A         src\tests
A         src\tests\antunit
A         src\tests\antunit\taskdefs
AU        src\tests\antunit\taskdefs\retry-test.xml
AU        src\tests\antunit\taskdefs\secure-input.xml
AU        src\tests\antunit\taskdefs\ear-test.xml
AU        src\tests\antunit\taskdefs\whichresource-test.xml
AU        src\tests\antunit\taskdefs\import-test.xml
A         src\tests\antunit\taskdefs\condition
AU        src\tests\antunit\taskdefs\condition\resourcecontains-test.xml
AU        src\tests\antunit\taskdefs\condition\resourceexists-test.xml
AU        src\tests\antunit\taskdefs\condition\antversion-test.xml
AU        src\tests\antunit\taskdefs\condition\hasfreespace-test.xml
AU        src\tests\antunit\taskdefs\condition\equals-test.xml
AU    ERROR: Failed to check out http://svn.apache.org/repos/asf/ant/core/trunk
org.tmatesoft.svn.core.SVNException: svn: Error processing command 'cp-and-translate' in 'F:\hudson\hudson-slave\workspace\Ant-Build-Matrix\jdk\JDK
1.5 (latest)\label\Windows\trunk'
	at org.tmatesoft.svn.core.internal.wc.SVNErrorManager.error(SVNErrorManager.java:85)
	at org.tmatesoft.svn.core.internal.wc.SVNErrorManager.error(SVNErrorManager.java:69)
	at org.tmatesoft.svn.core.internal.wc.admin.SVNLogRunner.runCommand(SVNLogRunner.java:487)
	at org.tmatesoft.svn.core.internal.wc.admin.SVNLog.run(SVNLog.java:225)
	at org.tmatesoft.svn.core.internal.wc.admin.SVNAdminArea.runLogs(SVNAdminArea.java:630)
	at org.tmatesoft.svn.core.internal.wc.admin.SVNAdminArea.runLogs(SVNAdminArea.java:613)
	at org.tmatesoft.svn.core.internal.wc.SVNUpdateEditor15$SVNDirectoryInfo.cleanup(SVNUpdateEditor15.java:1581)
	at org.tmatesoft.svn.core.internal.wc.admin.SVNWCAccess.doClose(SVNWCAccess.java:482)
	at org.tmatesoft.svn.core.internal.wc.admin.SVNWCAccess.doClose(SVNWCAccess.java:463)
	at org.tmatesoft.svn.core.internal.wc.admin.SVNWCAccess.close(SVNWCAccess.java:346)
	at org.tmatesoft.svn.core.wc.SVNUpdateClient.update(SVNUpdateClient.java:584)
	at org.tmatesoft.svn.core.wc.SVNUpdateClient.doCheckout(SVNUpdateClient.java:922)
	at hudson.scm.subversion.CheckoutUpdater$1.perform(CheckoutUpdater.java:84)
	at hudson.scm.subversion.WorkspaceUpdater$UpdateTask.delegateTo(WorkspaceUpdater.java:136)
	at hudson.scm.subversion.WorkspaceUpdater$UpdateTask.delegateTo(WorkspaceUpdater.java:144)
	at hudson.scm.subversion.UpdateUpdater$TaskImpl.perform(UpdateUpdater.java:121)
	at hudson.scm.subversion.WorkspaceUpdater$UpdateTask.delegateTo(WorkspaceUpdater.java:136)
	at hudson.scm.SubversionSCM$CheckOutTask.perform(SubversionSCM.java:788)
	at hudson.scm.SubversionSCM$CheckOutTask.invoke(SubversionSCM.java:769)
	at hudson.scm.SubversionSCM$CheckOutTask.invoke(SubversionSCM.java:753)
	at hudson.FilePath$FileCallableWrapper.call(FilePath.java:2154)
	at hudson.remoting.UserRequest.perform(UserRequest.java:118)
	at hudson.remoting.UserRequest.perform(UserRequest.java:48)
	at hudson.remoting.Request$2.run(Request.java:287)
	at hudson.remoting.InterceptingExecutorService$1.call(InterceptingExecutorService.java:72)
	at java.util.concurrent.FutureTask$Sync.innerRun(Unknown Source)
	at java.util.concurrent.FutureTask.run(Unknown Source)
	at java.util.concurrent.ThreadPoolExecutor.runWorker(Unknown Source)
	at java.util.concurrent.ThreadPoolExecutor$Worker.run(Unknown Source)
	at hudson.remoting.Engine$1$1.run(Engine.java:60)
	at java.lang.Thread.run(Unknown Source)
Caused by: org.tmatesoft.svn.core.SVNException: svn: Failed to translate 'F:\hudson\hudson-slave\workspace\Ant-Build-Matrix\jdk\JDK
1.5 (latest)\label\Windows\trunk\LICENSE'
	at org.tmatesoft.svn.core.internal.wc.SVNErrorManager.error(SVNErrorManager.java:85)
	at org.tmatesoft.svn.core.internal.wc.SVNErrorManager.error(SVNErrorManager.java:69)
	at org.tmatesoft.svn.core.internal.wc.admin.SVNTranslator.translationError(SVNTranslator.java:706)
	at org.tmatesoft.svn.core.internal.wc.admin.SVNTranslator.translate(SVNTranslator.java:184)
	at org.tmatesoft.svn.core.internal.wc.admin.SVNTranslator.translate(SVNTranslator.java:147)
	at org.tmatesoft.svn.core.internal.wc.admin.SVNTranslator.translate(SVNTranslator.java:101)
	at org.tmatesoft.svn.core.internal.wc.admin.SVNLogRunner.runCommand(SVNLogRunner.java:349)
	... 28 more
Caused by: java.io.IOException: There is not enough space on the disk
	at java.io.FileOutputStream.writeBytes(Native Method)
	at java.io.FileOutputStream.write(Unknown Source)
	at java.io.BufferedOutputStream.write(Unknown Source)
	at org.tmatesoft.svn.core.internal.wc.admin.SVNTranslatorOutputStream.write(SVNTranslatorOutputStream.java:55)
	at org.tmatesoft.svn.core.internal.wc.admin.SVNTranslator.copy(SVNTranslator.java:466)
	at org.tmatesoft.svn.core.internal.wc.admin.SVNTranslator.translate(SVNTranslator.java:182)
	... 31 more
    src\tests\antunit\taskdefs\condition\filesmatch-test.xml
AU        src\tests\antunit\taskdefs\condition\islastmodified-test.xml
AU        src\tests\antunit\taskdefs\condition\hasmethod-text.xml
FATAL: null
java.lang.NullPointerException
	at java.util.ArrayList.addAll(ArrayList.java:530)
	at hudson.scm.SubversionSCM.checkout(SubversionSCM.java:743)
	at hudson.scm.SubversionSCM.checkout(SubversionSCM.java:685)
	at hudson.model.AbstractProject.checkout(AbstractProject.java:1218)
	at hudson.model.AbstractBuild$AbstractRunner.checkout(AbstractBuild.java:581)
	at hudson.model.AbstractBuild$AbstractRunner.run(AbstractBuild.java:470)
	at hudson.model.Run.run(Run.java:1434)
	at hudson.matrix.MatrixRun.run(MatrixRun.java:146)
	at hudson.model.ResourceController.execute(ResourceController.java:88)
	at hudson.model.Executor.run(Executor.java:239)

Mime
View raw message