ant-notifications mailing list archives

Site index · List index
Message view « Date » · « Thread »
Top « Date » · « Thread »
From Apache Jenkins Server <jenk...@builds.apache.org>
Subject Build failed in Jenkins: Ivy-tests #80
Date Wed, 15 Feb 2012 10:39:55 GMT
See <https://builds.apache.org/job/Ivy-tests/80/changes>

Changes:

[maartenc] FIX: NullPointerException when providing empty password to <credentials>
(IVY-1335)

[maartenc] For some reason 'Sebastian Krueger' was removed from the contributor list in my
previous commit.

[maartenc] FIX: [originalname] not expanded for source and javadoc types during publish in
ivy:install (IVY-1324)

------------------------------------------
[...truncated 3055 lines...]
      [jar] Building jar: <https://builds.apache.org/job/Ivy-tests/ws/trunk/test/jar-repos/jarrepo1_subdir.jar>

test-internal:
    [mkdir] Created dir: <https://builds.apache.org/job/Ivy-tests/ws/trunk/build/test-report>
    [junit] Running org.apache.ivy.IvyTest
    [junit] Tests run: 1, Failures: 0, Errors: 0, Time elapsed: 14,036 sec
    [junit] Running org.apache.ivy.MainTest
    [junit] Tests run: 9, Failures: 0, Errors: 0, Time elapsed: 0,925 sec
    [junit] Running org.apache.ivy.ant.AntBuildTriggerTest
    [junit] Tests run: 1, Failures: 0, Errors: 0, Time elapsed: 1,596 sec
    [junit] Running org.apache.ivy.ant.AntCallTriggerTest
    [junit] Tests run: 1, Failures: 0, Errors: 0, Time elapsed: 2,803 sec
    [junit] Running org.apache.ivy.ant.IvyAntSettingsBuildFileTest
    [junit] Tests run: 5, Failures: 0, Errors: 0, Time elapsed: 1,276 sec
    [junit] Running org.apache.ivy.ant.IvyArtifactPropertyTest
    [junit] Tests run: 3, Failures: 0, Errors: 0, Time elapsed: 1,055 sec
    [junit] Running org.apache.ivy.ant.IvyArtifactReportTest
    [junit] Tests run: 1, Failures: 0, Errors: 0, Time elapsed: 0,794 sec
    [junit] Running org.apache.ivy.ant.IvyBuildListTest
    [junit] Tests run: 15, Failures: 0, Errors: 0, Time elapsed: 2,311 sec
    [junit] Running org.apache.ivy.ant.IvyBuildNumberTest
    [junit] Tests run: 12, Failures: 0, Errors: 0, Time elapsed: 0,774 sec
    [junit] Running org.apache.ivy.ant.IvyCacheFilesetTest
    [junit] Tests run: 7, Failures: 0, Errors: 0, Time elapsed: 1,104 sec
    [junit] Running org.apache.ivy.ant.IvyCachePathTest
    [junit] Tests run: 9, Failures: 0, Errors: 0, Time elapsed: 1,577 sec
    [junit] Running org.apache.ivy.ant.IvyCleanCacheTest
    [junit] Tests run: 5, Failures: 0, Errors: 0, Time elapsed: 0,485 sec
    [junit] Running org.apache.ivy.ant.IvyConfigureTest
    [junit] Tests run: 13, Failures: 0, Errors: 0, Time elapsed: 0,672 sec
    [junit] Running org.apache.ivy.ant.IvyConvertPomTest
    [junit] Tests run: 1, Failures: 0, Errors: 0, Time elapsed: 1,111 sec
    [junit] Running org.apache.ivy.ant.IvyDeliverTest
    [junit] Tests run: 15, Failures: 0, Errors: 0, Time elapsed: 5,548 sec
    [junit] Running org.apache.ivy.ant.IvyFindRevisionTest
    [junit] Tests run: 3, Failures: 0, Errors: 0, Time elapsed: 0,636 sec
    [junit] Running org.apache.ivy.ant.IvyInfoRepositoryTest
    [junit] Tests run: 3, Failures: 0, Errors: 0, Time elapsed: 0,626 sec
    [junit] Running org.apache.ivy.ant.IvyInfoTest
    [junit] Tests run: 4, Failures: 0, Errors: 0, Time elapsed: 0,872 sec
    [junit] Running org.apache.ivy.ant.IvyInstallTest
    [junit] Tests run: 12, Failures: 0, Errors: 1, Time elapsed: 2,107 sec
    [junit] Test org.apache.ivy.ant.IvyInstallTest FAILED
    [junit] Running org.apache.ivy.ant.IvyListModulesTest
    [junit] Tests run: 2, Failures: 0, Errors: 0, Time elapsed: 0,538 sec
    [junit] Running org.apache.ivy.ant.IvyPostResolveTaskTest
    [junit] Tests run: 13, Failures: 0, Errors: 0, Time elapsed: 1,769 sec
    [junit] Running org.apache.ivy.ant.IvyPublishTest
    [junit] Tests run: 21, Failures: 0, Errors: 0, Time elapsed: 3,018 sec
    [junit] Running org.apache.ivy.ant.IvyReportTest
    [junit] Tests run: 6, Failures: 0, Errors: 0, Time elapsed: 2,03 sec
    [junit] Running org.apache.ivy.ant.IvyRepositoryReportTest
    [junit] Tests run: 3, Failures: 0, Errors: 0, Time elapsed: 1,109 sec
    [junit] Running org.apache.ivy.ant.IvyResolveTest
    [junit] Tests run: 31, Failures: 0, Errors: 0, Time elapsed: 2,777 sec
    [junit] Running org.apache.ivy.ant.IvyResourcesTest
    [junit] Tests run: 8, Failures: 0, Errors: 0, Time elapsed: 1,455 sec
    [junit] Running org.apache.ivy.ant.IvyRetrieveBuildFileTest
    [junit] Tests run: 1, Failures: 0, Errors: 0, Time elapsed: 0,821 sec
    [junit] Running org.apache.ivy.ant.IvyRetrieveTest
    [junit] Tests run: 19, Failures: 0, Errors: 0, Time elapsed: 2,111 sec
    [junit] Running org.apache.ivy.ant.IvyTaskTest
    [junit] Tests run: 3, Failures: 0, Errors: 0, Time elapsed: 0,476 sec
    [junit] Running org.apache.ivy.ant.IvyVarTest
    [junit] Tests run: 4, Failures: 0, Errors: 0, Time elapsed: 0,56 sec
    [junit] Running org.apache.ivy.core.NormalRelativeUrlResolverTest
    [junit] Tests run: 7, Failures: 0, Errors: 0, Time elapsed: 1,056 sec
    [junit] Running org.apache.ivy.core.cache.DefaultRepositoryCacheManagerTest
    [junit] Tests run: 2, Failures: 0, Errors: 0, Time elapsed: 4,753 sec
    [junit] Running org.apache.ivy.core.cache.ModuleDescriptorMemoryCacheTest
    [junit] Tests run: 10, Failures: 0, Errors: 0, Time elapsed: 0,065 sec
    [junit] Running org.apache.ivy.core.deliver.DeliverTest
    [junit] Tests run: 1, Failures: 0, Errors: 0, Time elapsed: 1,003 sec
    [junit] Running org.apache.ivy.core.event.IvyEventFilterTest
    [junit] Tests run: 5, Failures: 0, Errors: 0, Time elapsed: 0,433 sec
    [junit] Running org.apache.ivy.core.install.InstallTest
    [junit] Tests run: 9, Failures: 0, Errors: 0, Time elapsed: 2,223 sec
    [junit] Running org.apache.ivy.core.module.descriptor.DefaultDependencyDescriptorTest
    [junit] Tests run: 2, Failures: 0, Errors: 0, Time elapsed: 0,194 sec
    [junit] Running org.apache.ivy.core.module.id.ModuleIdTest
    [junit] Tests run: 11, Failures: 0, Errors: 0, Time elapsed: 0,211 sec
    [junit] Running org.apache.ivy.core.module.id.ModuleRevisionIdTest
    [junit] Tests run: 2, Failures: 0, Errors: 0, Time elapsed: 0,209 sec
    [junit] Running org.apache.ivy.core.module.id.ModuleRulesTest
    [junit] Tests run: 2, Failures: 0, Errors: 0, Time elapsed: 0,208 sec
    [junit] Running org.apache.ivy.core.publish.PublishEngineTest
    [junit] Tests run: 1, Failures: 0, Errors: 0, Time elapsed: 0,808 sec
    [junit] Running org.apache.ivy.core.publish.PublishEventsTest
    [junit] Tests run: 4, Failures: 0, Errors: 0, Time elapsed: 1,975 sec
    [junit] Running org.apache.ivy.core.repository.RepositoryManagementEngineTest
    [junit] Tests run: 2, Failures: 0, Errors: 0, Time elapsed: 2,988 sec
    [junit] Running org.apache.ivy.core.resolve.ResolveEngineTest
    [junit] Tests run: 2, Failures: 0, Errors: 0, Time elapsed: 0,545 sec
    [junit] Running org.apache.ivy.core.resolve.ResolveTest
    [junit] Tests run: 219, Failures: 15, Errors: 1, Time elapsed: 13,681 sec
    [junit] Test org.apache.ivy.core.resolve.ResolveTest FAILED
    [junit] Running org.apache.ivy.core.retrieve.RetrieveTest
    [junit] Tests run: 8, Failures: 0, Errors: 0, Time elapsed: 1,295 sec
    [junit] Running org.apache.ivy.core.search.SearchTest
    [junit] Tests run: 3, Failures: 2, Errors: 0, Time elapsed: 0,436 sec
    [junit] Test org.apache.ivy.core.search.SearchTest FAILED
    [junit] Running org.apache.ivy.core.settings.ConfigureTest
    [junit] Tests run: 4, Failures: 0, Errors: 0, Time elapsed: 0,469 sec
    [junit] Running org.apache.ivy.core.settings.IvySettingsTest
    [junit] Tests run: 1, Failures: 0, Errors: 0, Time elapsed: 0,418 sec
    [junit] Running org.apache.ivy.core.settings.OnlineXmlSettingsParserTest
    [junit] Tests run: 4, Failures: 0, Errors: 0, Time elapsed: 1,278 sec
    [junit] Running org.apache.ivy.core.settings.XmlSettingsParserTest
    [junit] Tests run: 25, Failures: 0, Errors: 0, Time elapsed: 0,629 sec
    [junit] Running org.apache.ivy.core.sort.SortTest
    [junit] Tests run: 8, Failures: 0, Errors: 0, Time elapsed: 0,445 sec
    [junit] Running org.apache.ivy.osgi.core.ExecutionEnvironmentProfileLoaderTest
    [junit] Tests run: 1, Failures: 0, Errors: 0, Time elapsed: 0,215 sec
    [junit] Running org.apache.ivy.osgi.core.ManifestHeaderTest
    [junit] Tests run: 4, Failures: 0, Errors: 0, Time elapsed: 0,206 sec
    [junit] Running org.apache.ivy.osgi.core.ManifestParserTest
    [junit] Tests run: 1, Failures: 0, Errors: 0, Time elapsed: 0,214 sec
    [junit] Running org.apache.ivy.osgi.core.OsgiRevisionStrategyTest
    [junit] Tests run: 4, Failures: 0, Errors: 0, Time elapsed: 0,461 sec
    [junit] Running org.apache.ivy.osgi.obr.OBRParserTest
    [junit] Tests run: 1, Failures: 0, Errors: 0, Time elapsed: 4,487 sec
    [junit] Running org.apache.ivy.osgi.obr.OBRResolverTest
    [junit] Tests run: 15, Failures: 0, Errors: 0, Time elapsed: 0,921 sec
    [junit] Running org.apache.ivy.osgi.obr.RequirementFilterTest
    [junit] Tests run: 1, Failures: 0, Errors: 0, Time elapsed: 0,188 sec
    [junit] Running org.apache.ivy.osgi.repo.BundleRepoTest
    [junit] Tests run: 4, Failures: 0, Errors: 0, Time elapsed: 1,552 sec
    [junit] Running org.apache.ivy.osgi.updatesite.UpdateSiteLoaderTest
    [junit] Tests run: 3, Failures: 0, Errors: 1, Time elapsed: 5,177 sec
    [junit] Test org.apache.ivy.osgi.updatesite.UpdateSiteLoaderTest FAILED
    [junit] Running org.apache.ivy.osgi.updatesite.UpdateSiteResolverTest
    [junit] Tests run: 3, Failures: 0, Errors: 0, Time elapsed: 0,727 sec
    [junit] Running org.apache.ivy.osgi.util.ArtifactTokensTest
    [junit] Tests run: 5, Failures: 0, Errors: 0, Time elapsed: 0,211 sec
    [junit] Running org.apache.ivy.osgi.util.ParseUtilTest
    [junit] Tests run: 1, Failures: 0, Errors: 0, Time elapsed: 0,198 sec
    [junit] Running org.apache.ivy.osgi.util.VersionRangeTest
    [junit] Tests run: 2, Failures: 0, Errors: 0, Time elapsed: 0,208 sec
    [junit] Running org.apache.ivy.osgi.util.VersionTest
    [junit] Tests run: 2, Failures: 0, Errors: 0, Time elapsed: 0,203 sec
    [junit] Running org.apache.ivy.plugins.circular.IgnoreCircularDependencyStrategyTest
    [junit] Tests run: 2, Failures: 0, Errors: 0, Time elapsed: 0,217 sec
    [junit] Running org.apache.ivy.plugins.circular.WarnCircularDependencyStrategyTest
    [junit] Tests run: 3, Failures: 0, Errors: 0, Time elapsed: 0,301 sec
    [junit] Running org.apache.ivy.plugins.conflict.LatestCompatibleConflictManagerTest
    [junit] Tests run: 11, Failures: 0, Errors: 0, Time elapsed: 2,85 sec
    [junit] Running org.apache.ivy.plugins.conflict.LatestConflictManagerTest
    [junit] Tests run: 5, Failures: 0, Errors: 0, Time elapsed: 0,89 sec
    [junit] Running org.apache.ivy.plugins.conflict.RegexpConflictManagerTest
    [junit] Tests run: 2, Failures: 0, Errors: 0, Time elapsed: 0,558 sec
    [junit] Running org.apache.ivy.plugins.conflict.StrictConflictManagerTest
    [junit] Tests run: 5, Failures: 0, Errors: 0, Time elapsed: 0,706 sec
    [junit] Running org.apache.ivy.plugins.latest.LatestRevisionStrategyTest
    [junit] Tests run: 4, Failures: 0, Errors: 0, Time elapsed: 0,466 sec
    [junit] Running org.apache.ivy.plugins.lock.ArtifactLockStrategyTest
    [junit] Tests run: 1, Failures: 0, Errors: 0, Time elapsed: 5,125 sec
    [junit] Running org.apache.ivy.plugins.matcher.ExactOrRegexpPatternMatcherTest
    [junit] Tests run: 7, Failures: 0, Errors: 0, Time elapsed: 0,488 sec
    [junit] Running org.apache.ivy.plugins.matcher.ExactPatternMatcherTest
    [junit] Tests run: 7, Failures: 0, Errors: 0, Time elapsed: 0,21 sec
    [junit] Running org.apache.ivy.plugins.matcher.GlobPatternMatcherTest
    [junit] Tests run: 13, Failures: 0, Errors: 0, Time elapsed: 0,832 sec
    [junit] Running org.apache.ivy.plugins.matcher.RegexpPatternMatcherTest
    [junit] Tests run: 7, Failures: 0, Errors: 0, Time elapsed: 0,491 sec
    [junit] Running org.apache.ivy.plugins.namespace.MRIDTransformationRuleTest
    [junit] Tests run: 1, Failures: 0, Errors: 0, Time elapsed: 0,207 sec
    [junit] Running org.apache.ivy.plugins.namespace.NameSpaceHelperTest
    [junit] Tests run: 1, Failures: 0, Errors: 0, Time elapsed: 0,215 sec
    [junit] Running org.apache.ivy.plugins.parser.ModuleDescriptorParserRegistryTest
    [junit] Tests run: 1, Failures: 0, Errors: 0, Time elapsed: 0,435 sec
    [junit] Running org.apache.ivy.plugins.parser.m2.PomModuleDescriptorParserTest
    [junit] Tests run: 39, Failures: 0, Errors: 0, Time elapsed: 1,071 sec
    [junit] Running org.apache.ivy.plugins.parser.m2.PomModuleDescriptorWriterTest
    [junit] Tests run: 11, Failures: 0, Errors: 0, Time elapsed: 0,708 sec
    [junit] Running org.apache.ivy.plugins.parser.xml.XmlModuleDescriptorParserTest
    [junit] Tests run: 40, Failures: 0, Errors: 0, Time elapsed: 1,508 sec
    [junit] Running org.apache.ivy.plugins.parser.xml.XmlModuleDescriptorWriterTest
    [junit] Tests run: 7, Failures: 0, Errors: 0, Time elapsed: 0,808 sec
    [junit] Running org.apache.ivy.plugins.parser.xml.XmlModuleUpdaterTest
    [junit] Tests run: 9, Failures: 0, Errors: 0, Time elapsed: 0,84 sec
    [junit] Running org.apache.ivy.plugins.report.XmlReportParserTest
    [junit] Tests run: 1, Failures: 0, Errors: 0, Time elapsed: 0,474 sec
    [junit] Running org.apache.ivy.plugins.report.XmlReportWriterTest
    [junit] Tests run: 3, Failures: 0, Errors: 0, Time elapsed: 2,045 sec
    [junit] Running org.apache.ivy.plugins.repository.vfs.VfsRepositoryTest
    [junit] Tests run: 7, Failures: 0, Errors: 0, Time elapsed: 0,683 sec
    [junit] Running org.apache.ivy.plugins.repository.vfs.VfsResourceTest
    [junit] Tests run: 6, Failures: 0, Errors: 0, Time elapsed: 0,547 sec
    [junit] Running org.apache.ivy.plugins.resolver.ChainResolverTest
    [junit] Tests run: 15, Failures: 0, Errors: 0, Time elapsed: 0,856 sec
    [junit] Running org.apache.ivy.plugins.resolver.DualResolverTest
    [junit] Tests run: 6, Failures: 0, Errors: 0, Time elapsed: 0,435 sec
    [junit] Running org.apache.ivy.plugins.resolver.FileSystemResolverTest
    [junit] Tests run: 25, Failures: 0, Errors: 0, Time elapsed: 1,588 sec
    [junit] Running org.apache.ivy.plugins.resolver.IBiblioResolverTest
    [junit] Tests run: 7, Failures: 0, Errors: 0, Time elapsed: 3,94 sec
    [junit] Running org.apache.ivy.plugins.resolver.IvyRepResolverTest
    [junit] Tests run: 3, Failures: 0, Errors: 0, Time elapsed: 0,772 sec
    [junit] Running org.apache.ivy.plugins.resolver.JarResolverTest
    [junit] Tests run: 3, Failures: 0, Errors: 0, Time elapsed: 0,857 sec
    [junit] Running org.apache.ivy.plugins.resolver.Maven2LocalTest
    [junit] Tests run: 2, Failures: 0, Errors: 0, Time elapsed: 0,601 sec
    [junit] Running org.apache.ivy.plugins.resolver.MirroredURLResolverTest
    [junit] Tests run: 3, Failures: 0, Errors: 0, Time elapsed: 1,597 sec
    [junit] Running org.apache.ivy.plugins.resolver.PackagerResolverTest
    [junit] Tests run: 3, Failures: 0, Errors: 0, Time elapsed: 1,697 sec
    [junit] Running org.apache.ivy.plugins.resolver.URLResolverTest
    [junit] Tests run: 8, Failures: 0, Errors: 0, Time elapsed: 1,83 sec
    [junit] Running org.apache.ivy.plugins.resolver.VfsResolverTest
    [junit] Tests run: 2, Failures: 0, Errors: 0, Time elapsed: 0,225 sec
    [junit] Running org.apache.ivy.plugins.resolver.util.ResolverHelperTest
    [junit] Tests run: 1, Failures: 0, Errors: 0, Time elapsed: 0,204 sec
    [junit] Running org.apache.ivy.plugins.trigger.LogTriggerTest
    [junit] Tests run: 3, Failures: 0, Errors: 0, Time elapsed: 0,398 sec
    [junit] Running org.apache.ivy.plugins.version.LatestVersionMatcherTest
    [junit] Tests run: 2, Failures: 0, Errors: 0, Time elapsed: 0,39 sec
    [junit] Running org.apache.ivy.plugins.version.PatternVersionMatcherTest
    [junit] Tests run: 3, Failures: 0, Errors: 0, Time elapsed: 0,4 sec
    [junit] Running org.apache.ivy.plugins.version.VersionRangeMatcherTest
    [junit] Tests run: 6, Failures: 0, Errors: 0, Time elapsed: 0,444 sec
    [junit] Running org.apache.ivy.util.ConfiguratorTest
    [junit] Tests run: 13, Failures: 0, Errors: 0, Time elapsed: 0,212 sec
    [junit] Running org.apache.ivy.util.IvyPatternHelperTest
    [junit] Tests run: 7, Failures: 0, Errors: 0, Time elapsed: 0,199 sec
    [junit] Running org.apache.ivy.util.StringUtilsTest
    [junit] Tests run: 2, Failures: 0, Errors: 0, Time elapsed: 0,197 sec
    [junit] Running org.apache.ivy.util.url.ApacheURLListerTest
    [junit] Tests run: 6, Failures: 0, Errors: 0, Time elapsed: 0,296 sec
    [junit] Running org.apache.ivy.util.url.ArtifactoryListingTest
    [junit] Tests run: 1, Failures: 0, Errors: 0, Time elapsed: 0,998 sec
    [junit] Running org.apache.ivy.util.url.BasicURLHandlerTest
    [junit] Tests run: 2, Failures: 0, Errors: 0, Time elapsed: 3,994 sec
    [junit] Running org.apache.ivy.util.url.HttpclientURLHandlerTest
    [junit] Tests run: 3, Failures: 0, Errors: 0, Time elapsed: 2,956 sec

test-report:
[junitreport] Processing <https://builds.apache.org/job/Ivy-tests/ws/trunk/build/test-report/TESTS-TestSuites.xml>
to /tmp/null967690203
[junitreport] Loading stylesheet jar:file:/home/hudson/tools/ant/apache-ant-1.7.0/lib/ant-junit.jar!/org/apache/tools/ant/taskdefs/optional/junit/xsl/junit-frames.xsl
[junitreport] Transform time: 13567ms
[junitreport] Deleting: /tmp/null967690203

BUILD FAILED
<https://builds.apache.org/job/Ivy-tests/ws/trunk/build.xml>:497: At least one test
has failed. See logs (in <https://builds.apache.org/job/Ivy-tests/ws/trunk/build/test-report)>
or report (in <https://builds.apache.org/job/Ivy-tests/ws/trunk/build/doc/reports/test)>

Total time: 3 minutes 24 seconds
Build step 'Invoke Ant' marked build as failure
[locks-and-latches] Releasing all the locks
[locks-and-latches] All the locks released
Recording test results


Mime
View raw message