ant-notifications mailing list archives

Site index · List index
Message view « Date » · « Thread »
Top « Date » · « Thread »
From Apache Hudson Server <hud...@hudson.apache.org>
Subject Build failed in Jenkins: Ivy-tests #38
Date Thu, 14 Apr 2011 10:34:55 GMT
See <https://hudson.apache.org/hudson/job/Ivy-tests/38/changes>

Changes:

[hibou] Add support for a composite P2 repository

------------------------------------------
[...truncated 164 lines...]
    [junit] Tests run: 15, Failures: 0, Errors: 0, Time elapsed: 1,794 sec
    [junit] Running org.apache.ivy.ant.IvyBuildNumberTest
    [junit] Tests run: 12, Failures: 0, Errors: 0, Time elapsed: 0,573 sec
    [junit] Running org.apache.ivy.ant.IvyCacheFilesetTest
    [junit] Tests run: 7, Failures: 0, Errors: 0, Time elapsed: 0,819 sec
    [junit] Running org.apache.ivy.ant.IvyCachePathTest
    [junit] Tests run: 9, Failures: 0, Errors: 0, Time elapsed: 1,146 sec
    [junit] Running org.apache.ivy.ant.IvyCleanCacheTest
    [junit] Tests run: 5, Failures: 0, Errors: 0, Time elapsed: 0,353 sec
    [junit] Running org.apache.ivy.ant.IvyConfigureTest
    [junit] Tests run: 13, Failures: 0, Errors: 0, Time elapsed: 0,532 sec
    [junit] Running org.apache.ivy.ant.IvyConvertPomTest
    [junit] Tests run: 1, Failures: 0, Errors: 0, Time elapsed: 0,629 sec
    [junit] Running org.apache.ivy.ant.IvyDeliverTest
    [junit] Tests run: 15, Failures: 0, Errors: 0, Time elapsed: 1,716 sec
    [junit] Running org.apache.ivy.ant.IvyFindRevisionTest
    [junit] Tests run: 3, Failures: 0, Errors: 0, Time elapsed: 0,48 sec
    [junit] Running org.apache.ivy.ant.IvyInfoRepositoryTest
    [junit] Tests run: 3, Failures: 0, Errors: 0, Time elapsed: 0,478 sec
    [junit] Running org.apache.ivy.ant.IvyInfoTest
    [junit] Tests run: 4, Failures: 0, Errors: 0, Time elapsed: 0,637 sec
    [junit] Running org.apache.ivy.ant.IvyInstallTest
    [junit] Tests run: 11, Failures: 0, Errors: 0, Time elapsed: 1,403 sec
    [junit] Running org.apache.ivy.ant.IvyListModulesTest
    [junit] Tests run: 2, Failures: 0, Errors: 0, Time elapsed: 0,382 sec
    [junit] Running org.apache.ivy.ant.IvyPostResolveTaskTest
    [junit] Tests run: 13, Failures: 0, Errors: 0, Time elapsed: 1,284 sec
    [junit] Running org.apache.ivy.ant.IvyPublishTest
    [junit] Tests run: 18, Failures: 0, Errors: 0, Time elapsed: 1,628 sec
    [junit] Running org.apache.ivy.ant.IvyReportTest
    [junit] Tests run: 6, Failures: 0, Errors: 0, Time elapsed: 1,685 sec
    [junit] Running org.apache.ivy.ant.IvyRepositoryReportTest
    [junit] Tests run: 3, Failures: 0, Errors: 0, Time elapsed: 0,876 sec
    [junit] Running org.apache.ivy.ant.IvyResolveTest
    [junit] Tests run: 31, Failures: 0, Errors: 0, Time elapsed: 1,899 sec
    [junit] Running org.apache.ivy.ant.IvyResourcesTest
    [junit] Tests run: 8, Failures: 0, Errors: 0, Time elapsed: 1,047 sec
    [junit] Running org.apache.ivy.ant.IvyRetrieveBuildFileTest
    [junit] Tests run: 1, Failures: 0, Errors: 0, Time elapsed: 0,573 sec
    [junit] Running org.apache.ivy.ant.IvyRetrieveTest
    [junit] Tests run: 19, Failures: 0, Errors: 0, Time elapsed: 1,567 sec
    [junit] Running org.apache.ivy.ant.IvyTaskTest
    [junit] Tests run: 3, Failures: 0, Errors: 0, Time elapsed: 0,374 sec
    [junit] Running org.apache.ivy.ant.IvyVarTest
    [junit] Tests run: 4, Failures: 0, Errors: 0, Time elapsed: 0,422 sec
    [junit] Running org.apache.ivy.core.NormalRelativeUrlResolverTest
    [junit] Tests run: 7, Failures: 0, Errors: 0, Time elapsed: 1,463 sec
    [junit] Running org.apache.ivy.core.cache.DefaultRepositoryCacheManagerTest
    [junit] Tests run: 2, Failures: 0, Errors: 0, Time elapsed: 0,358 sec
    [junit] Running org.apache.ivy.core.cache.ModuleDescriptorMemoryCacheTest
    [junit] Tests run: 10, Failures: 0, Errors: 0, Time elapsed: 0,047 sec
    [junit] Running org.apache.ivy.core.deliver.DeliverTest
    [junit] Tests run: 1, Failures: 0, Errors: 0, Time elapsed: 0,924 sec
    [junit] Running org.apache.ivy.core.event.IvyEventFilterTest
    [junit] Tests run: 5, Failures: 0, Errors: 0, Time elapsed: 0,303 sec
    [junit] Running org.apache.ivy.core.install.InstallTest
    [junit] Tests run: 9, Failures: 0, Errors: 0, Time elapsed: 1,399 sec
    [junit] Running org.apache.ivy.core.module.descriptor.DefaultDependencyDescriptorTest
    [junit] Tests run: 2, Failures: 0, Errors: 0, Time elapsed: 0,126 sec
    [junit] Running org.apache.ivy.core.module.id.ModuleIdTest
    [junit] Tests run: 11, Failures: 0, Errors: 0, Time elapsed: 0,128 sec
    [junit] Running org.apache.ivy.core.module.id.ModuleRevisionIdTest
    [junit] Tests run: 2, Failures: 0, Errors: 0, Time elapsed: 0,128 sec
    [junit] Running org.apache.ivy.core.module.id.ModuleRulesTest
    [junit] Tests run: 2, Failures: 0, Errors: 0, Time elapsed: 0,132 sec
    [junit] Running org.apache.ivy.core.publish.PublishEngineTest
    [junit] Tests run: 1, Failures: 0, Errors: 0, Time elapsed: 0,622 sec
    [junit] Running org.apache.ivy.core.publish.PublishEventsTest
    [junit] Tests run: 4, Failures: 0, Errors: 0, Time elapsed: 0,383 sec
    [junit] Running org.apache.ivy.core.repository.RepositoryManagementEngineTest
    [junit] Tests run: 2, Failures: 0, Errors: 0, Time elapsed: 0,941 sec
    [junit] Running org.apache.ivy.core.resolve.ResolveEngineTest
    [junit] Tests run: 2, Failures: 0, Errors: 0, Time elapsed: 0,394 sec
    [junit] Running org.apache.ivy.core.resolve.ResolveTest
    [junit] Tests run: 218, Failures: 0, Errors: 0, Time elapsed: 10,174 sec
    [junit] Running org.apache.ivy.core.retrieve.RetrieveTest
    [junit] Tests run: 8, Failures: 0, Errors: 0, Time elapsed: 0,991 sec
    [junit] Running org.apache.ivy.core.search.SearchTest
    [junit] Tests run: 3, Failures: 0, Errors: 0, Time elapsed: 0,315 sec
    [junit] Running org.apache.ivy.core.settings.ConfigureTest
    [junit] Tests run: 4, Failures: 0, Errors: 0, Time elapsed: 0,338 sec
    [junit] Running org.apache.ivy.core.settings.IvySettingsTest
    [junit] Tests run: 1, Failures: 0, Errors: 0, Time elapsed: 0,288 sec
    [junit] Running org.apache.ivy.core.settings.OnlineXmlSettingsParserTest
    [junit] Tests run: 4, Failures: 0, Errors: 0, Time elapsed: 1,055 sec
    [junit] Running org.apache.ivy.core.settings.XmlSettingsParserTest
    [junit] Tests run: 25, Failures: 0, Errors: 0, Time elapsed: 0,481 sec
    [junit] Running org.apache.ivy.core.sort.SortTest
    [junit] Tests run: 8, Failures: 0, Errors: 0, Time elapsed: 0,331 sec
    [junit] Running org.apache.ivy.osgi.core.ExecutionEnvironmentProfileLoaderTest
    [junit] Tests run: 1, Failures: 0, Errors: 0, Time elapsed: 0,144 sec
    [junit] Running org.apache.ivy.osgi.core.ManifestHeaderTest
    [junit] Tests run: 4, Failures: 0, Errors: 0, Time elapsed: 0,136 sec
    [junit] Running org.apache.ivy.osgi.core.ManifestParserTest
    [junit] Tests run: 1, Failures: 0, Errors: 0, Time elapsed: 0,227 sec
    [junit] Running org.apache.ivy.osgi.core.OsgiRevisionStrategyTest
    [junit] Tests run: 4, Failures: 0, Errors: 0, Time elapsed: 0,326 sec
    [junit] Running org.apache.ivy.osgi.obr.OBRParserTest
    [junit] Tests run: 1, Failures: 0, Errors: 0, Time elapsed: 2,271 sec
    [junit] Running org.apache.ivy.osgi.obr.OBRResolverTest
    [junit] Tests run: 15, Failures: 0, Errors: 0, Time elapsed: 0,7 sec
    [junit] Running org.apache.ivy.osgi.obr.RequirementFilterTest
    [junit] Tests run: 1, Failures: 0, Errors: 0, Time elapsed: 0,123 sec
    [junit] Running org.apache.ivy.osgi.repo.BundleRepoTest
    [junit] Tests run: 4, Failures: 0, Errors: 0, Time elapsed: 1,147 sec
    [junit] Running org.apache.ivy.osgi.updatesite.UpdateSiteLoaderTest
    [junit] Tests run: 2, Failures: 0, Errors: 0, Time elapsed: 5,967 sec
    [junit] Running org.apache.ivy.osgi.util.ArtifactTokensTest
    [junit] Tests run: 5, Failures: 0, Errors: 0, Time elapsed: 0,129 sec
    [junit] Running org.apache.ivy.osgi.util.ParseUtilTest
    [junit] Tests run: 1, Failures: 0, Errors: 0, Time elapsed: 0,121 sec
    [junit] Running org.apache.ivy.osgi.util.VersionRangeTest
    [junit] Tests run: 2, Failures: 0, Errors: 0, Time elapsed: 0,126 sec
    [junit] Running org.apache.ivy.osgi.util.VersionTest
    [junit] Tests run: 2, Failures: 0, Errors: 0, Time elapsed: 0,124 sec
    [junit] Running org.apache.ivy.plugins.circular.IgnoreCircularDependencyStrategyTest
    [junit] Tests run: 2, Failures: 0, Errors: 0, Time elapsed: 0,136 sec
    [junit] Running org.apache.ivy.plugins.circular.WarnCircularDependencyStrategyTest
    [junit] Tests run: 3, Failures: 0, Errors: 0, Time elapsed: 0,204 sec
    [junit] Running org.apache.ivy.plugins.conflict.LatestCompatibleConflictManagerTest
    [junit] Tests run: 11, Failures: 0, Errors: 0, Time elapsed: 1,815 sec
    [junit] Running org.apache.ivy.plugins.conflict.LatestConflictManagerTest
    [junit] Tests run: 5, Failures: 0, Errors: 0, Time elapsed: 1,087 sec
    [junit] Running org.apache.ivy.plugins.conflict.RegexpConflictManagerTest
    [junit] Tests run: 2, Failures: 0, Errors: 0, Time elapsed: 0,407 sec
    [junit] Running org.apache.ivy.plugins.conflict.StrictConflictManagerTest
    [junit] Tests run: 5, Failures: 0, Errors: 0, Time elapsed: 0,579 sec
    [junit] Running org.apache.ivy.plugins.latest.LatestRevisionStrategyTest
    [junit] Tests run: 4, Failures: 0, Errors: 0, Time elapsed: 0,323 sec
    [junit] Running org.apache.ivy.plugins.lock.ArtifactLockStrategyTest
    [junit] Tests run: 1, Failures: 0, Errors: 0, Time elapsed: 4,208 sec
    [junit] Running org.apache.ivy.plugins.matcher.ExactOrRegexpPatternMatcherTest
    [junit] Tests run: 7, Failures: 0, Errors: 0, Time elapsed: 0,391 sec
    [junit] Running org.apache.ivy.plugins.matcher.ExactPatternMatcherTest
    [junit] Tests run: 7, Failures: 0, Errors: 0, Time elapsed: 0,142 sec
    [junit] Running org.apache.ivy.plugins.matcher.GlobPatternMatcherTest
    [junit] Tests run: 13, Failures: 0, Errors: 0, Time elapsed: 0,779 sec
    [junit] Running org.apache.ivy.plugins.matcher.RegexpPatternMatcherTest
    [junit] Tests run: 7, Failures: 0, Errors: 0, Time elapsed: 0,39 sec
    [junit] Running org.apache.ivy.plugins.namespace.MRIDTransformationRuleTest
    [junit] Tests run: 1, Failures: 0, Errors: 0, Time elapsed: 0,14 sec
    [junit] Running org.apache.ivy.plugins.namespace.NameSpaceHelperTest
    [junit] Tests run: 1, Failures: 0, Errors: 0, Time elapsed: 0,137 sec
    [junit] Running org.apache.ivy.plugins.parser.ModuleDescriptorParserRegistryTest
    [junit] Tests run: 1, Failures: 0, Errors: 0, Time elapsed: 0,302 sec
    [junit] Running org.apache.ivy.plugins.parser.m2.PomModuleDescriptorParserTest
    [junit] Tests run: 36, Failures: 0, Errors: 0, Time elapsed: 0,841 sec
    [junit] Running org.apache.ivy.plugins.parser.m2.PomModuleDescriptorWriterTest
    [junit] Tests run: 9, Failures: 0, Errors: 0, Time elapsed: 0,489 sec
    [junit] Running org.apache.ivy.plugins.parser.xml.XmlModuleDescriptorParserTest
    [junit] Tests run: 40, Failures: 0, Errors: 0, Time elapsed: 1,096 sec
    [junit] Running org.apache.ivy.plugins.parser.xml.XmlModuleDescriptorWriterTest
    [junit] Tests run: 7, Failures: 0, Errors: 0, Time elapsed: 0,578 sec
    [junit] Running org.apache.ivy.plugins.parser.xml.XmlModuleUpdaterTest
    [junit] Tests run: 9, Failures: 0, Errors: 0, Time elapsed: 0,635 sec
    [junit] Running org.apache.ivy.plugins.report.XmlReportParserTest
    [junit] Tests run: 1, Failures: 0, Errors: 0, Time elapsed: 0,369 sec
    [junit] Running org.apache.ivy.plugins.report.XmlReportWriterTest
    [junit] Tests run: 3, Failures: 0, Errors: 0, Time elapsed: 0,653 sec
    [junit] Running org.apache.ivy.plugins.repository.vfs.VfsRepositoryTest
    [junit] Tests run: 7, Failures: 0, Errors: 0, Time elapsed: 0,574 sec
    [junit] Running org.apache.ivy.plugins.repository.vfs.VfsResourceTest
    [junit] Tests run: 6, Failures: 0, Errors: 0, Time elapsed: 0,449 sec
    [junit] Running org.apache.ivy.plugins.resolver.ChainResolverTest
    [junit] Tests run: 15, Failures: 0, Errors: 0, Time elapsed: 0,617 sec
    [junit] Running org.apache.ivy.plugins.resolver.DualResolverTest
    [junit] Tests run: 6, Failures: 0, Errors: 0, Time elapsed: 0,363 sec
    [junit] Running org.apache.ivy.plugins.resolver.FileSystemResolverTest
    [junit] Tests run: 25, Failures: 0, Errors: 0, Time elapsed: 1,005 sec
    [junit] Running org.apache.ivy.plugins.resolver.IBiblioResolverTest
    [junit] Tests run: 7, Failures: 1, Errors: 0, Time elapsed: 13,579 sec
    [junit] Test org.apache.ivy.plugins.resolver.IBiblioResolverTest FAILED
    [junit] Running org.apache.ivy.plugins.resolver.IvyRepResolverTest
    [junit] Tests run: 3, Failures: 0, Errors: 0, Time elapsed: 0,55 sec
    [junit] Running org.apache.ivy.plugins.resolver.Maven2LocalTest
    [junit] Tests run: 2, Failures: 0, Errors: 0, Time elapsed: 0,441 sec
    [junit] Running org.apache.ivy.plugins.resolver.MirroredURLResolverTest
    [junit] Tests run: 3, Failures: 0, Errors: 0, Time elapsed: 1,875 sec
    [junit] Running org.apache.ivy.plugins.resolver.PackagerResolverTest
    [junit] Tests run: 3, Failures: 0, Errors: 0, Time elapsed: 1,507 sec
    [junit] Running org.apache.ivy.plugins.resolver.URLResolverTest
    [junit] , unknown tag html in <https://hudson.apache.org/hudson/job/Ivy-tests/ws/trunk/build/cache/unknown/unknown/ivy-1.0.xml.original>
    [junit] , unknown tag head in <https://hudson.apache.org/hudson/job/Ivy-tests/ws/trunk/build/cache/unknown/unknown/ivy-1.0.xml.original>
    [junit] , unknown tag meta in <https://hudson.apache.org/hudson/job/Ivy-tests/ws/trunk/build/cache/unknown/unknown/ivy-1.0.xml.original>
    [junit] , unknown tag meta in <https://hudson.apache.org/hudson/job/Ivy-tests/ws/trunk/build/cache/unknown/unknown/ivy-1.0.xml.original>
    [junit] , unknown tag link in <https://hudson.apache.org/hudson/job/Ivy-tests/ws/trunk/build/cache/unknown/unknown/ivy-1.0.xml.original>
    [junit] , unknown tag title in <https://hudson.apache.org/hudson/job/Ivy-tests/ws/trunk/build/cache/unknown/unknown/ivy-1.0.xml.original>
    [junit] , unknown tag body in <https://hudson.apache.org/hudson/job/Ivy-tests/ws/trunk/build/cache/unknown/unknown/ivy-1.0.xml.original>
    [junit] , unknown tag div in <https://hudson.apache.org/hudson/job/Ivy-tests/ws/trunk/build/cache/unknown/unknown/ivy-1.0.xml.original>
    [junit] , unknown tag table in <https://hudson.apache.org/hudson/job/Ivy-tests/ws/trunk/build/cache/unknown/unknown/ivy-1.0.xml.original>
    [junit] , unknown tag tr in <https://hudson.apache.org/hudson/job/Ivy-tests/ws/trunk/build/cache/unknown/unknown/ivy-1.0.xml.original>
    [junit] , unknown tag td in <https://hudson.apache.org/hudson/job/Ivy-tests/ws/trunk/build/cache/unknown/unknown/ivy-1.0.xml.original>
    [junit] , unknown tag table in <https://hudson.apache.org/hudson/job/Ivy-tests/ws/trunk/build/cache/unknown/unknown/ivy-1.0.xml.original>
    [junit] , unknown tag tr in <https://hudson.apache.org/hudson/job/Ivy-tests/ws/trunk/build/cache/unknown/unknown/ivy-1.0.xml.original>
    [junit] , unknown tag td in <https://hudson.apache.org/hudson/job/Ivy-tests/ws/trunk/build/cache/unknown/unknown/ivy-1.0.xml.original>
    [junit] , unknown tag div in <https://hudson.apache.org/hudson/job/Ivy-tests/ws/trunk/build/cache/unknown/unknown/ivy-1.0.xml.original>
    [junit] , unknown tag div in <https://hudson.apache.org/hudson/job/Ivy-tests/ws/trunk/build/cache/unknown/unknown/ivy-1.0.xml.original>
    [junit] , unknown tag div in <https://hudson.apache.org/hudson/job/Ivy-tests/ws/trunk/build/cache/unknown/unknown/ivy-1.0.xml.original>
    [junit] , unknown tag div in <https://hudson.apache.org/hudson/job/Ivy-tests/ws/trunk/build/cache/unknown/unknown/ivy-1.0.xml.original>
    [junit] , unknown tag a in <https://hudson.apache.org/hudson/job/Ivy-tests/ws/trunk/build/cache/unknown/unknown/ivy-1.0.xml.original>
    [junit] , unknown tag span in <https://hudson.apache.org/hudson/job/Ivy-tests/ws/trunk/build/cache/unknown/unknown/ivy-1.0.xml.original>
    [junit] , unknown tag div in <https://hudson.apache.org/hudson/job/Ivy-tests/ws/trunk/build/cache/unknown/unknown/ivy-1.0.xml.original>
    [junit] , unknown tag div in <https://hudson.apache.org/hudson/job/Ivy-tests/ws/trunk/build/cache/unknown/unknown/ivy-1.0.xml.original>
    [junit] , unknown tag a in <https://hudson.apache.org/hudson/job/Ivy-tests/ws/trunk/build/cache/unknown/unknown/ivy-1.0.xml.original>
    [junit] , unknown tag span in <https://hudson.apache.org/hudson/job/Ivy-tests/ws/trunk/build/cache/unknown/unknown/ivy-1.0.xml.original>
    [junit] , [Fatal Error] ivy-1.0.xml.original:62:22: The value of attribute "id" associated
with an element type "div" must not contain the '<' character. in <https://hudson.apache.org/hudson/job/Ivy-tests/ws/trunk/build/cache/unknown/unknown/ivy-1.0.xml.original>
    [junit] ])
    [junit] Tests run: 8, Failures: 1, Errors: 2, Time elapsed: 89,87 sec
    [junit] Test org.apache.ivy.plugins.resolver.URLResolverTest FAILED
    [junit] Running org.apache.ivy.plugins.resolver.VfsResolverTest
    [junit] Tests run: 2, Failures: 0, Errors: 0, Time elapsed: 0,147 sec
    [junit] Running org.apache.ivy.plugins.resolver.util.ResolverHelperTest
    [junit] Tests run: 1, Failures: 0, Errors: 0, Time elapsed: 0,134 sec
    [junit] Running org.apache.ivy.plugins.trigger.LogTriggerTest
    [junit] Tests run: 3, Failures: 0, Errors: 0, Time elapsed: 0,3 sec
    [junit] Running org.apache.ivy.plugins.version.LatestVersionMatcherTest
    [junit] Tests run: 2, Failures: 0, Errors: 0, Time elapsed: 0,292 sec
    [junit] Running org.apache.ivy.plugins.version.PatternVersionMatcherTest
    [junit] Tests run: 3, Failures: 0, Errors: 0, Time elapsed: 0,293 sec
    [junit] Running org.apache.ivy.plugins.version.VersionRangeMatcherTest
    [junit] Tests run: 6, Failures: 0, Errors: 0, Time elapsed: 0,315 sec
    [junit] Running org.apache.ivy.util.ConfiguratorTest
    [junit] Tests run: 13, Failures: 0, Errors: 0, Time elapsed: 0,169 sec
    [junit] Running org.apache.ivy.util.IvyPatternHelperTest
    [junit] Tests run: 7, Failures: 0, Errors: 0, Time elapsed: 0,13 sec
    [junit] Running org.apache.ivy.util.StringUtilsTest
    [junit] Tests run: 2, Failures: 0, Errors: 0, Time elapsed: 0,123 sec
    [junit] Running org.apache.ivy.util.url.ApacheURLListerTest
    [junit] Tests run: 6, Failures: 0, Errors: 0, Time elapsed: 0,313 sec
    [junit] Running org.apache.ivy.util.url.ArtifactoryListingTest
    [junit] Tests run: 1, Failures: 0, Errors: 0, Time elapsed: 1,354 sec
    [junit] Running org.apache.ivy.util.url.BasicURLHandlerTest
    [junit] Tests run: 2, Failures: 0, Errors: 0, Time elapsed: 10,748 sec
    [junit] Running org.apache.ivy.util.url.HttpclientURLHandlerTest
    [junit] Tests run: 3, Failures: 0, Errors: 0, Time elapsed: 2,84 sec

test-report:
[junitreport] Processing <https://hudson.apache.org/hudson/job/Ivy-tests/ws/trunk/build/test-report/TESTS-TestSuites.xml>
to /tmp/null1261864960
[junitreport] Loading stylesheet jar:file:/home/hudson/tools/ant/apache-ant-1.7.0/lib/ant-junit.jar!/org/apache/tools/ant/taskdefs/optional/junit/xsl/junit-frames.xsl
[junitreport] Transform time: 12717ms
[junitreport] Deleting: /tmp/null1261864960

BUILD FAILED
<https://hudson.apache.org/hudson/job/Ivy-tests/ws/trunk/build.xml>:487: At least one
test has failed. See logs (in <https://hudson.apache.org/hudson/job/Ivy-tests/ws/trunk/build/test-report)>
or report (in <https://hudson.apache.org/hudson/job/Ivy-tests/ws/trunk/build/doc/reports/test)>

Total time: 4 minutes 18 seconds
[locks-and-latches] Releasing all the locks
[locks-and-latches] All the locks released
Recording test results


Mime
View raw message