ant-notifications mailing list archives

Site index · List index
Message view « Date » · « Thread »
Top « Date » · « Thread »
From Apache Hudson Server <hud...@hudson.apache.org>
Subject Build failed in Jenkins: Ivy-tests #32
Date Tue, 15 Mar 2011 22:08:34 GMT
See <https://hudson.apache.org/hudson/job/Ivy-tests/32/changes>

Changes:

[maartenc] Removed dead code.

------------------------------------------
[...truncated 122 lines...]
      [jar] Warning: skipping jar archive <https://hudson.apache.org/hudson/job/Ivy-tests/ws/trunk/test/test-repo/bundlerepo/org.apache.ivy.osgi.testbundle.importing_3.2.1.jar>
because no files were included.

generate-bundle:
      [jar] Warning: skipping jar archive <https://hudson.apache.org/hudson/job/Ivy-tests/ws/trunk/test/test-repo/bundlerepo/org.apache.ivy.osgi.testbundle.require.ambiguity_1.1.1.jar>
because no files were included.

generate-bundle:
      [jar] Warning: skipping jar archive <https://hudson.apache.org/hudson/job/Ivy-tests/ws/trunk/test/test-repo/bundlerepo/org.apache.ivy.osgi.testbundle.require_1.1.1.jar>
because no files were included.

generate-bundle:
      [jar] Warning: skipping jar archive <https://hudson.apache.org/hudson/job/Ivy-tests/ws/trunk/test/test-repo/bundlerepo/org.apache.ivy.osgi.testbundle.use_2.2.2.jar>
because no files were included.

generate-bundle:
      [jar] Warning: skipping jar archive <https://hudson.apache.org/hudson/job/Ivy-tests/ws/trunk/test/test-repo/bundlerepo/org.apache.ivy.osgi.testbundle_1.2.3.jar>
because no files were included.

test-internal:
    [junit] Running org.apache.ivy.IvyTest
    [junit] Tests run: 1, Failures: 0, Errors: 0, Time elapsed: 1,689 sec
    [junit] Running org.apache.ivy.MainTest
    [junit] Tests run: 9, Failures: 0, Errors: 0, Time elapsed: 0,725 sec
    [junit] Running org.apache.ivy.ant.AntBuildTriggerTest
    [junit] Tests run: 1, Failures: 0, Errors: 0, Time elapsed: 1,038 sec
    [junit] Running org.apache.ivy.ant.AntCallTriggerTest
    [junit] Tests run: 1, Failures: 0, Errors: 0, Time elapsed: 0,832 sec
    [junit] Running org.apache.ivy.ant.IvyAntSettingsBuildFileTest
    [junit] Tests run: 5, Failures: 0, Errors: 0, Time elapsed: 1,412 sec
    [junit] Running org.apache.ivy.ant.IvyArtifactPropertyTest
    [junit] Tests run: 3, Failures: 0, Errors: 0, Time elapsed: 0,843 sec
    [junit] Running org.apache.ivy.ant.IvyArtifactReportTest
    [junit] Tests run: 1, Failures: 0, Errors: 0, Time elapsed: 0,666 sec
    [junit] Running org.apache.ivy.ant.IvyBuildListTest
    [junit] Tests run: 15, Failures: 0, Errors: 0, Time elapsed: 2,63 sec
    [junit] Running org.apache.ivy.ant.IvyBuildNumberTest
    [junit] Tests run: 12, Failures: 0, Errors: 0, Time elapsed: 0,564 sec
    [junit] Running org.apache.ivy.ant.IvyCacheFilesetTest
    [junit] Tests run: 7, Failures: 0, Errors: 0, Time elapsed: 0,787 sec
    [junit] Running org.apache.ivy.ant.IvyCachePathTest
    [junit] Tests run: 9, Failures: 0, Errors: 0, Time elapsed: 1,182 sec
    [junit] Running org.apache.ivy.ant.IvyCleanCacheTest
    [junit] Tests run: 5, Failures: 0, Errors: 0, Time elapsed: 0,596 sec
    [junit] Running org.apache.ivy.ant.IvyConfigureTest
    [junit] Tests run: 13, Failures: 0, Errors: 0, Time elapsed: 0,563 sec
    [junit] Running org.apache.ivy.ant.IvyConvertPomTest
    [junit] Tests run: 1, Failures: 0, Errors: 0, Time elapsed: 0,774 sec
    [junit] Running org.apache.ivy.ant.IvyDeliverTest
    [junit] Tests run: 15, Failures: 0, Errors: 0, Time elapsed: 1,837 sec
    [junit] Running org.apache.ivy.ant.IvyFindRevisionTest
    [junit] Tests run: 3, Failures: 0, Errors: 0, Time elapsed: 0,483 sec
    [junit] Running org.apache.ivy.ant.IvyInfoRepositoryTest
    [junit] Tests run: 3, Failures: 0, Errors: 0, Time elapsed: 0,485 sec
    [junit] Running org.apache.ivy.ant.IvyInfoTest
    [junit] Tests run: 4, Failures: 0, Errors: 0, Time elapsed: 0,64 sec
    [junit] Running org.apache.ivy.ant.IvyInstallTest
    [junit] Tests run: 11, Failures: 0, Errors: 0, Time elapsed: 1,539 sec
    [junit] Running org.apache.ivy.ant.IvyListModulesTest
    [junit] Tests run: 2, Failures: 0, Errors: 0, Time elapsed: 0,381 sec
    [junit] Running org.apache.ivy.ant.IvyPostResolveTaskTest
    [junit] Tests run: 13, Failures: 0, Errors: 0, Time elapsed: 1,283 sec
    [junit] Running org.apache.ivy.ant.IvyPublishTest
    [junit] Tests run: 18, Failures: 0, Errors: 0, Time elapsed: 2,583 sec
    [junit] Running org.apache.ivy.ant.IvyReportTest
    [junit] Tests run: 6, Failures: 0, Errors: 0, Time elapsed: 1,842 sec
    [junit] Running org.apache.ivy.ant.IvyRepositoryReportTest
    [junit] Tests run: 3, Failures: 0, Errors: 0, Time elapsed: 0,884 sec
    [junit] Running org.apache.ivy.ant.IvyResolveTest
    [junit] Tests run: 31, Failures: 0, Errors: 0, Time elapsed: 1,843 sec
    [junit] Running org.apache.ivy.ant.IvyResourcesTest
    [junit] Tests run: 8, Failures: 0, Errors: 0, Time elapsed: 1,067 sec
    [junit] Running org.apache.ivy.ant.IvyRetrieveBuildFileTest
    [junit] Tests run: 1, Failures: 0, Errors: 0, Time elapsed: 0,612 sec
    [junit] Running org.apache.ivy.ant.IvyRetrieveTest
    [junit] Tests run: 19, Failures: 0, Errors: 0, Time elapsed: 2,414 sec
    [junit] Running org.apache.ivy.ant.IvyTaskTest
    [junit] Tests run: 3, Failures: 0, Errors: 0, Time elapsed: 0,372 sec
    [junit] Running org.apache.ivy.ant.IvyVarTest
    [junit] Tests run: 4, Failures: 0, Errors: 0, Time elapsed: 0,421 sec
    [junit] Running org.apache.ivy.core.NormalRelativeUrlResolverTest
    [junit] Tests run: 7, Failures: 0, Errors: 0, Time elapsed: 0,331 sec
    [junit] Running org.apache.ivy.core.cache.DefaultRepositoryCacheManagerTest
    [junit] Tests run: 2, Failures: 0, Errors: 0, Time elapsed: 0,358 sec
    [junit] Running org.apache.ivy.core.cache.ModuleDescriptorMemoryCacheTest
    [junit] Tests run: 10, Failures: 0, Errors: 0, Time elapsed: 0,048 sec
    [junit] Running org.apache.ivy.core.deliver.DeliverTest
    [junit] Tests run: 1, Failures: 0, Errors: 0, Time elapsed: 1,384 sec
    [junit] Running org.apache.ivy.core.event.IvyEventFilterTest
    [junit] Tests run: 5, Failures: 0, Errors: 0, Time elapsed: 0,328 sec
    [junit] Running org.apache.ivy.core.install.InstallTest
    [junit] Tests run: 9, Failures: 0, Errors: 0, Time elapsed: 1,76 sec
    [junit] Running org.apache.ivy.core.module.descriptor.DefaultDependencyDescriptorTest
    [junit] Tests run: 2, Failures: 0, Errors: 0, Time elapsed: 0,126 sec
    [junit] Running org.apache.ivy.core.module.id.ModuleIdTest
    [junit] Tests run: 11, Failures: 0, Errors: 0, Time elapsed: 0,129 sec
    [junit] Running org.apache.ivy.core.module.id.ModuleRevisionIdTest
    [junit] Tests run: 2, Failures: 0, Errors: 0, Time elapsed: 0,13 sec
    [junit] Running org.apache.ivy.core.module.id.ModuleRulesTest
    [junit] Tests run: 2, Failures: 0, Errors: 0, Time elapsed: 0,219 sec
    [junit] Running org.apache.ivy.core.publish.PublishEngineTest
    [junit] Tests run: 1, Failures: 0, Errors: 0, Time elapsed: 0,625 sec
    [junit] Running org.apache.ivy.core.publish.PublishEventsTest
    [junit] Tests run: 4, Failures: 0, Errors: 0, Time elapsed: 0,356 sec
    [junit] Running org.apache.ivy.core.repository.RepositoryManagementEngineTest
    [junit] Tests run: 2, Failures: 0, Errors: 0, Time elapsed: 0,984 sec
    [junit] Running org.apache.ivy.core.resolve.ResolveEngineTest
    [junit] Tests run: 2, Failures: 0, Errors: 0, Time elapsed: 0,394 sec
    [junit] Running org.apache.ivy.core.resolve.ResolveTest
    [junit] Tests run: 218, Failures: 0, Errors: 0, Time elapsed: 12,63 sec
    [junit] Running org.apache.ivy.core.retrieve.RetrieveTest
    [junit] Tests run: 8, Failures: 0, Errors: 0, Time elapsed: 0,997 sec
    [junit] Running org.apache.ivy.core.search.SearchTest
    [junit] Tests run: 3, Failures: 0, Errors: 0, Time elapsed: 0,309 sec
    [junit] Running org.apache.ivy.core.settings.ConfigureTest
    [junit] Tests run: 4, Failures: 0, Errors: 0, Time elapsed: 0,345 sec
    [junit] Running org.apache.ivy.core.settings.IvySettingsTest
    [junit] Tests run: 1, Failures: 0, Errors: 0, Time elapsed: 0,287 sec
    [junit] Running org.apache.ivy.core.settings.OnlineXmlSettingsParserTest
    [junit] Tests run: 4, Failures: 0, Errors: 0, Time elapsed: 1,639 sec
    [junit] Running org.apache.ivy.core.settings.XmlSettingsParserTest
    [junit] Tests run: 25, Failures: 0, Errors: 0, Time elapsed: 0,521 sec
    [junit] Running org.apache.ivy.core.sort.SortTest
    [junit] Tests run: 8, Failures: 0, Errors: 0, Time elapsed: 0,334 sec
    [junit] Running org.apache.ivy.osgi.core.ExecutionEnvironmentProfileLoaderTest
    [junit] Tests run: 1, Failures: 0, Errors: 0, Time elapsed: 0,152 sec
    [junit] Running org.apache.ivy.osgi.core.ManifestHeaderTest
    [junit] Tests run: 4, Failures: 0, Errors: 0, Time elapsed: 0,135 sec
    [junit] Running org.apache.ivy.osgi.core.ManifestParserTest
    [junit] Tests run: 1, Failures: 0, Errors: 0, Time elapsed: 0,176 sec
    [junit] Running org.apache.ivy.osgi.obr.OBRParserTest
    [junit] Tests run: 1, Failures: 0, Errors: 0, Time elapsed: 2,384 sec
    [junit] Running org.apache.ivy.osgi.obr.OBRResolverTest
    [junit] Tests run: 15, Failures: 0, Errors: 0, Time elapsed: 0,744 sec
    [junit] Running org.apache.ivy.osgi.obr.RequirementFilterTest
    [junit] Tests run: 1, Failures: 0, Errors: 0, Time elapsed: 0,122 sec
    [junit] Running org.apache.ivy.osgi.repo.BundleRepoTest
    [junit] Tests run: 4, Failures: 0, Errors: 0, Time elapsed: 1,308 sec
    [junit] Running org.apache.ivy.osgi.updatesite.UpdateSiteLoaderTest
    [junit] Tests run: 1, Failures: 0, Errors: 0, Time elapsed: 0,669 sec
    [junit] Running org.apache.ivy.osgi.util.ArtifactTokensTest
    [junit] Tests run: 5, Failures: 0, Errors: 0, Time elapsed: 0,134 sec
    [junit] Running org.apache.ivy.osgi.util.ParseUtilTest
    [junit] Tests run: 1, Failures: 0, Errors: 0, Time elapsed: 0,121 sec
    [junit] Running org.apache.ivy.osgi.util.VersionRangeTest
    [junit] Tests run: 2, Failures: 0, Errors: 0, Time elapsed: 0,126 sec
    [junit] Running org.apache.ivy.osgi.util.VersionTest
    [junit] Tests run: 2, Failures: 0, Errors: 0, Time elapsed: 0,123 sec
    [junit] Running org.apache.ivy.plugins.circular.IgnoreCircularDependencyStrategyTest
    [junit] Tests run: 2, Failures: 0, Errors: 0, Time elapsed: 0,137 sec
    [junit] Running org.apache.ivy.plugins.circular.WarnCircularDependencyStrategyTest
    [junit] Tests run: 3, Failures: 0, Errors: 0, Time elapsed: 0,206 sec
    [junit] Running org.apache.ivy.plugins.conflict.LatestCompatibleConflictManagerTest
    [junit] Tests run: 11, Failures: 0, Errors: 0, Time elapsed: 1,968 sec
    [junit] Running org.apache.ivy.plugins.conflict.LatestConflictManagerTest
    [junit] Tests run: 5, Failures: 0, Errors: 0, Time elapsed: 0,704 sec
    [junit] Running org.apache.ivy.plugins.conflict.RegexpConflictManagerTest
    [junit] Tests run: 2, Failures: 0, Errors: 0, Time elapsed: 0,402 sec
    [junit] Running org.apache.ivy.plugins.conflict.StrictConflictManagerTest
    [junit] Tests run: 5, Failures: 0, Errors: 0, Time elapsed: 0,544 sec
    [junit] Running org.apache.ivy.plugins.latest.LatestRevisionStrategyTest
    [junit] Tests run: 4, Failures: 0, Errors: 0, Time elapsed: 0,327 sec
    [junit] Running org.apache.ivy.plugins.lock.ArtifactLockStrategyTest
    [junit] Tests run: 1, Failures: 0, Errors: 0, Time elapsed: 3,992 sec
    [junit] Running org.apache.ivy.plugins.matcher.ExactOrRegexpPatternMatcherTest
    [junit] Tests run: 7, Failures: 0, Errors: 0, Time elapsed: 0,396 sec
    [junit] Running org.apache.ivy.plugins.matcher.ExactPatternMatcherTest
    [junit] Tests run: 7, Failures: 0, Errors: 0, Time elapsed: 0,155 sec
    [junit] Running org.apache.ivy.plugins.matcher.GlobPatternMatcherTest
    [junit] Tests run: 13, Failures: 0, Errors: 0, Time elapsed: 0,758 sec
    [junit] Running org.apache.ivy.plugins.matcher.RegexpPatternMatcherTest
    [junit] Tests run: 7, Failures: 0, Errors: 0, Time elapsed: 0,389 sec
    [junit] Running org.apache.ivy.plugins.namespace.MRIDTransformationRuleTest
    [junit] Tests run: 1, Failures: 0, Errors: 0, Time elapsed: 0,141 sec
    [junit] Running org.apache.ivy.plugins.namespace.NameSpaceHelperTest
    [junit] Tests run: 1, Failures: 0, Errors: 0, Time elapsed: 0,136 sec
    [junit] Running org.apache.ivy.plugins.parser.ModuleDescriptorParserRegistryTest
    [junit] Tests run: 1, Failures: 0, Errors: 0, Time elapsed: 0,299 sec
    [junit] Running org.apache.ivy.plugins.parser.m2.PomModuleDescriptorParserTest
    [junit] Tests run: 36, Failures: 0, Errors: 0, Time elapsed: 0,847 sec
    [junit] Running org.apache.ivy.plugins.parser.m2.PomModuleDescriptorWriterTest
    [junit] Tests run: 9, Failures: 0, Errors: 0, Time elapsed: 0,49 sec
    [junit] Running org.apache.ivy.plugins.parser.xml.XmlModuleDescriptorParserTest
    [junit] Tests run: 40, Failures: 0, Errors: 0, Time elapsed: 1,41 sec
    [junit] Running org.apache.ivy.plugins.parser.xml.XmlModuleDescriptorWriterTest
    [junit] Tests run: 7, Failures: 0, Errors: 0, Time elapsed: 0,569 sec
    [junit] Running org.apache.ivy.plugins.parser.xml.XmlModuleUpdaterTest
    [junit] Tests run: 9, Failures: 0, Errors: 0, Time elapsed: 0,731 sec
    [junit] Running org.apache.ivy.plugins.report.XmlReportParserTest
    [junit] Tests run: 1, Failures: 0, Errors: 0, Time elapsed: 0,37 sec
    [junit] Running org.apache.ivy.plugins.report.XmlReportWriterTest
    [junit] Tests run: 3, Failures: 0, Errors: 0, Time elapsed: 0,635 sec
    [junit] Running org.apache.ivy.plugins.repository.vfs.VfsRepositoryTest
    [junit] Tests run: 7, Failures: 0, Errors: 0, Time elapsed: 0,603 sec
    [junit] Running org.apache.ivy.plugins.repository.vfs.VfsResourceTest
    [junit] Tests run: 6, Failures: 0, Errors: 0, Time elapsed: 0,47 sec
    [junit] Running org.apache.ivy.plugins.resolver.ChainResolverTest
    [junit] Tests run: 15, Failures: 0, Errors: 0, Time elapsed: 0,628 sec
    [junit] Running org.apache.ivy.plugins.resolver.DualResolverTest
    [junit] Tests run: 6, Failures: 0, Errors: 0, Time elapsed: 0,355 sec
    [junit] Running org.apache.ivy.plugins.resolver.FileSystemResolverTest
    [junit] Tests run: 25, Failures: 0, Errors: 0, Time elapsed: 1,522 sec
    [junit] Running org.apache.ivy.plugins.resolver.IBiblioResolverTest
    [junit] Tests run: 7, Failures: 1, Errors: 0, Time elapsed: 14,353 sec
    [junit] Test org.apache.ivy.plugins.resolver.IBiblioResolverTest FAILED
    [junit] Running org.apache.ivy.plugins.resolver.IvyRepResolverTest
    [junit] Tests run: 3, Failures: 0, Errors: 0, Time elapsed: 0,56 sec
    [junit] Running org.apache.ivy.plugins.resolver.Maven2LocalTest
    [junit] Tests run: 2, Failures: 0, Errors: 0, Time elapsed: 0,446 sec
    [junit] Running org.apache.ivy.plugins.resolver.PackagerResolverTest
    [junit] Tests run: 3, Failures: 0, Errors: 0, Time elapsed: 1,586 sec
    [junit] Running org.apache.ivy.plugins.resolver.URLResolverTest
    [junit] Tests run: 8, Failures: 1, Errors: 2, Time elapsed: 75,565 sec
    [junit] Test org.apache.ivy.plugins.resolver.URLResolverTest FAILED
    [junit] Running org.apache.ivy.plugins.resolver.VfsResolverTest
    [junit] Tests run: 2, Failures: 0, Errors: 0, Time elapsed: 0,147 sec
    [junit] Running org.apache.ivy.plugins.resolver.util.ResolverHelperTest
    [junit] Tests run: 1, Failures: 0, Errors: 0, Time elapsed: 0,132 sec
    [junit] Running org.apache.ivy.plugins.trigger.LogTriggerTest
    [junit] Tests run: 3, Failures: 0, Errors: 0, Time elapsed: 0,301 sec
    [junit] Running org.apache.ivy.plugins.version.LatestVersionMatcherTest
    [junit] Tests run: 2, Failures: 0, Errors: 0, Time elapsed: 0,294 sec
    [junit] Running org.apache.ivy.plugins.version.PatternVersionMatcherTest
    [junit] Tests run: 3, Failures: 0, Errors: 0, Time elapsed: 0,291 sec
    [junit] Running org.apache.ivy.plugins.version.VersionRangeMatcherTest
    [junit] Tests run: 6, Failures: 0, Errors: 0, Time elapsed: 0,315 sec
    [junit] Running org.apache.ivy.util.ConfiguratorTest
    [junit] Tests run: 13, Failures: 0, Errors: 0, Time elapsed: 0,169 sec
    [junit] Running org.apache.ivy.util.IvyPatternHelperTest
    [junit] Tests run: 7, Failures: 0, Errors: 0, Time elapsed: 0,136 sec
    [junit] Running org.apache.ivy.util.StringUtilsTest
    [junit] Tests run: 2, Failures: 0, Errors: 0, Time elapsed: 0,129 sec
    [junit] Running org.apache.ivy.util.url.ApacheURLListerTest
    [junit] Tests run: 6, Failures: 0, Errors: 0, Time elapsed: 0,29 sec
    [junit] Running org.apache.ivy.util.url.ArtifactoryListingTest
    [junit] Tests run: 1, Failures: 0, Errors: 0, Time elapsed: 1,75 sec
    [junit] Running org.apache.ivy.util.url.BasicURLHandlerTest
    [junit] Tests run: 2, Failures: 0, Errors: 0, Time elapsed: 4,236 sec
    [junit] Running org.apache.ivy.util.url.HttpclientURLHandlerTest
    [junit] Tests run: 3, Failures: 0, Errors: 0, Time elapsed: 2,899 sec

test-report:
[junitreport] Processing <https://hudson.apache.org/hudson/job/Ivy-tests/ws/trunk/build/test-report/TESTS-TestSuites.xml>
to /tmp/null557426080
[junitreport] Loading stylesheet jar:file:/home/hudson/tools/ant/apache-ant-1.7.0/lib/ant-junit.jar!/org/apache/tools/ant/taskdefs/optional/junit/xsl/junit-frames.xsl
[junitreport] Transform time: 14805ms
[junitreport] Deleting: /tmp/null557426080

BUILD FAILED
<https://hudson.apache.org/hudson/job/Ivy-tests/ws/trunk/build.xml>:487: At least one
test has failed. See logs (in <https://hudson.apache.org/hudson/job/Ivy-tests/ws/trunk/build/test-report)>
or report (in <https://hudson.apache.org/hudson/job/Ivy-tests/ws/trunk/build/doc/reports/test)>

Total time: 4 minutes 9 seconds
[locks-and-latches] Releasing all the locks
[locks-and-latches] All the locks released
Recording test results


Mime
View raw message