ant-notifications mailing list archives

Site index · List index
Message view « Date » · « Thread »
Top « Date » · « Thread »
From Gump Integration Build <bode...@apache.org>
Subject [GUMP@vmgump]: Project svn-antlib-test (in module ant-antlibs) failed
Date Tue, 08 Jun 2010 02:11:15 GMT
To whom it may engage...
        
This is an automated request, but not an unsolicited one. For 
more information please visit http://gump.apache.org/nagged.html, 
and/or contact the folk at general@gump.apache.org.

Project svn-antlib-test has an issue affecting its community integration.
This issue affects 1 projects,
 and has been outstanding for 6 runs.
The current state of this project is 'Failed', with reason 'Build Failed'.
For reference only, the following projects are affected by this:
    - svn-antlib-test :  Task and Type Libraries for Apache Ant


Full details are available at:
    http://vmgump.apache.org/gump/public/ant-antlibs/svn-antlib-test/index.html

That said, some information snippets are provided here.

The following annotations (debug/informational/warning/error messages) were provided:
 -DEBUG- Dependency on ant-testutil exists, no need to add for property ant-testutil.jar.
 -INFO- Failed with reason build failed



The following work was performed:
http://vmgump.apache.org/gump/public/ant-antlibs/svn-antlib-test/gump_work/build_ant-antlibs_svn-antlib-test.html
Work Name: build_ant-antlibs_svn-antlib-test (Type: Build)
Work ended in a state of : Failed
Elapsed: 45 secs
Command Line: /usr/lib/jvm/java-6-sun/bin/java -Djava.awt.headless=true -Xbootclasspath/p:/srv/gump/public/workspace/xml-xerces2/build/xercesImpl.jar:/srv/gump/public/workspace/xml-commons/java/external/build/xml-apis.jar
org.apache.tools.ant.Main -Dgump.merge=/srv/gump/public/gump/work/merge.xml -Dbuild.sysclasspath=only
-Dant-testutil.jar=/srv/gump/public/workspace/ant/build/lib/ant-testutil.jar test 
[Working Directory: /srv/gump/public/workspace/ant-antlibs/svn]
CLASSPATH: /usr/lib/jvm/java-6-sun/lib/tools.jar:/srv/gump/public/workspace/ant-antlibs/svn/build/test-classes:/srv/gump/public/workspace/ant/dist/lib/ant-jmf.jar:/srv/gump/public/workspace/ant/dist/lib/ant-swing.jar:/srv/gump/public/workspace/ant/dist/lib/ant-apache-resolver.jar:/srv/gump/public/workspace/ant/dist/lib/ant-apache-xalan2.jar:/srv/gump/public/workspace/ant/dist/lib/ant-junit.jar:/srv/gump/public/workspace/ant/dist/lib/ant-launcher.jar:/srv/gump/public/workspace/ant/dist/lib/ant.jar:/srv/gump/public/workspace/ant/build/lib/ant-testutil.jar:/srv/gump/public/workspace/junit/dist/junit-08062010.jar:/srv/gump/public/workspace/ant-antlibs/svn/build/ant-svn-08062010.jar:/srv/gump/public/workspace/xml-commons/java/external/build/xml-apis-ext.jar
---------------------------------------------
    [junit] 	at org.junit.internal.runners.JUnit38ClassRunner.run(JUnit38ClassRunner.java:83)
    [junit] 	at junit.framework.JUnit4TestAdapter.run(JUnit4TestAdapter.java:39)
    [junit] 	at org.apache.tools.ant.taskdefs.optional.junit.JUnitTestRunner.run(JUnitTestRunner.java:422)
    [junit] 	at org.apache.tools.ant.taskdefs.optional.junit.JUnitTestRunner.launch(JUnitTestRunner.java:931)
    [junit] 	at org.apache.tools.ant.taskdefs.optional.junit.JUnitTestRunner.main(JUnitTestRunner.java:758)
    [junit] Caused by: java.lang.NumberFormatException: For input string: ".2009"
    [junit] 	at java.lang.NumberFormatException.forInputString(NumberFormatException.java:48)
    [junit] 	at java.lang.Long.parseLong(Long.java:403)
    [junit] 	at java.lang.Long.parseLong(Long.java:461)
    [junit] 	at java.text.DigitList.getLong(DigitList.java:177)
    [junit] 	at java.text.DecimalFormat.parse(DecimalFormat.java:1298)
    [junit] 	at java.text.SimpleDateFormat.subParse(SimpleDateFormat.java:1544)
    [junit] 	at java.text.SimpleDateFormat.parse(SimpleDateFormat.java:1264)
    [junit] 	at java.text.DateFormat.parse(DateFormat.java:335)
    [junit] 	at org.apache.ant.svn.SvnChangeLogParser.parseDate(SvnChangeLogParser.java:173)
    [junit] 	at org.apache.ant.svn.SvnChangeLogParser.processRevision(SvnChangeLogParser.java:135)
    [junit] 	at org.apache.ant.svn.SvnChangeLogParser.processLine(SvnChangeLogParser.java:73)
    [junit] 	at org.apache.ant.svn.LineOrientedOutputStream.processBuffer(LineOrientedOutputStream.java:79)
    [junit] 	at org.apache.ant.svn.LineOrientedOutputStream.flush(LineOrientedOutputStream.java:69)
    [junit] 	at org.apache.tools.ant.taskdefs.PumpStreamHandler.stop(PumpStreamHandler.java:143)
    [junit] 	at org.apache.tools.ant.taskdefs.Execute.execute(Execute.java:500)
    [junit] 	at org.apache.ant.svn.AbstractSvnTask.runCommand(AbstractSvnTask.java:273)
    [junit] 	... 32 more
    [junit] 
    [junit] TEST org.apache.ant.svn.SvnChangeLogTaskTest FAILED
    [junit] Testsuite: org.apache.ant.svn.SvnRevisionDiffTest
    [junit] Tests run: 2, Failures: 0, Errors: 0, Time elapsed: 5.661 sec
    [junit] 
    [junit] Testcase: testDiff took 4.948 sec
    [junit] Testcase: testDiffUrl took 0.71 sec
    [junit] Testsuite: org.apache.ant.svn.SvnTagDiffTest
    [junit] Tests run: 3, Failures: 0, Errors: 0, Time elapsed: 10.001 sec
    [junit] 
    [junit] Testcase: testDiffWithTwoTags took 1.652 sec
    [junit] Testcase: testDiffWithExplicitTrunk took 4.372 sec
    [junit] Testcase: testDiffWithImplicitTrunk took 3.975 sec
    [junit] Tests FAILED

setup-for-antunit-tests:

ready-to-test-with-antunit:

antunit-test:

test:

BUILD FAILED
/srv/gump/public/workspace/ant-antlibs/svn/common/build.xml:222: At least one JUnit test has
failed.

Total time: 45 seconds
---------------------------------------------

To subscribe to this information via syndicated feeds:
- RSS: http://vmgump.apache.org/gump/public/ant-antlibs/svn-antlib-test/rss.xml
- Atom: http://vmgump.apache.org/gump/public/ant-antlibs/svn-antlib-test/atom.xml

============================== Gump Tracking Only ===
Produced by Gump version 2.3.
Gump Run 16000008062010, vmgump:vmgump-public:16000008062010
Gump E-mail Identifier (unique within run) #13.

--
Apache Gump
http://gump.apache.org/ [Instance: vmgump]

Mime
View raw message