ant-notifications mailing list archives

Site index · List index
Message view « Date » · « Thread »
Top « Date » · « Thread »
From Apache Hudson Server <hud...@hudson.zones.apache.org>
Subject Build failed in Hudson: Ant (JDK 1.4) #9
Date Sat, 31 Oct 2009 21:29:22 GMT
See <http://hudson.zones.apache.org/hudson/job/Ant%20(JDK%201.4)/9/>

------------------------------------------
[...truncated 3032 lines...]
[au:antunit] Target: test-refid took 0.002 sec
[au:antunit] Target: test-directUse took 0.001 sec
[au:antunit] Build File: /zonestorage/hudson/home/hudson/hudson/jobs/Ant (JDK 1.4)/workspace/trunk/src/tests/antunit/types/patternset-invert-test.xml
[au:antunit] Tests run: 2, Failures: 0, Errors: 0, Time elapsed: 1.997 sec
[au:antunit] Target: testInvertRefid took 0.584 sec
[au:antunit] Target: testInvertNested took 0.004 sec
[au:antunit] Build File: /zonestorage/hudson/home/hudson/hudson/jobs/Ant (JDK 1.4)/workspace/trunk/src/tests/antunit/types/patternset-test.xml
[au:antunit] Tests run: 4, Failures: 0, Errors: 0, Time elapsed: 0.562 sec
[au:antunit] Target: testIfFalse took 0.53 sec
[au:antunit] Target: testIfNotSet took 0.003 sec
[au:antunit] Target: testIfTrue took 0.003 sec
[au:antunit] Target: testIfSet took 0.006 sec
[au:antunit] Build File: /zonestorage/hudson/home/hudson/hudson/jobs/Ant (JDK 1.4)/workspace/trunk/src/tests/antunit/types/resources/archives-test.xml
[au:antunit] Tests run: 5, Failures: 0, Errors: 0, Time elapsed: 26.655 sec
[au:antunit] Target: testCircularReference took 0.005 sec
[au:antunit] Target: testMixingZipsAndTars took 0.148 sec
[au:antunit] Target: testReference took 0.014 sec
[au:antunit] Target: testExtractJars took 5.89 sec
[au:antunit] Target: testZipManualExample took 0.428 sec
[au:antunit] Build File: /zonestorage/hudson/home/hudson/hudson/jobs/Ant (JDK 1.4)/workspace/trunk/src/tests/antunit/types/resources/comparators/test.xml
[au:antunit] Tests run: 17, Failures: 1, Errors: 0, Time elapsed: 71.155 sec
[au:antunit] Target: testname took 4.423 sec
[au:antunit] Target: testcompoundsort2  FAILED
[au:antunit] 	at line 273, column 20
[au:antunit] 	Message: Assertion failed
[au:antunit] 	took 4.046 sec
[au:antunit] Target: testcompoundsort1 took 4.022 sec
[au:antunit] Target: testsortdefault took 4.048 sec
[au:antunit] Target: testtype took 4.023 sec
[au:antunit] Target: testrvsize took 4.023 sec
[au:antunit] Target: testrvcontent took 4.024 sec
[au:antunit] Target: testcontent took 4.126 sec
[au:antunit] Target: testrvdefault took 4.022 sec
[au:antunit] Target: testexists took 4.016 sec
[au:antunit] Target: testrvdate took 4.017 sec
[au:antunit] Target: testrvexists took 4.021 sec
[au:antunit] Target: testsize took 4.525 sec
[au:antunit] Target: testrvname took 4.022 sec
[au:antunit] Target: testEquals took 4.084 sec
[au:antunit] Target: testrvtype took 4.062 sec
[au:antunit] Target: testdate took 4.309 sec
[au:antunit] Build File: /zonestorage/hudson/home/hudson/hudson/jobs/Ant (JDK 1.4)/workspace/trunk/src/tests/antunit/types/resources/concat-resource-test.xml
[au:antunit] Tests run: 7, Failures: 0, Errors: 0, Time elapsed: 33.837 sec
[au:antunit] Target: testFixLastLineResources took 0.004 sec
[au:antunit] Target: testReplacement took 0.001 sec
[au:antunit] Target: testCountEquals1 took 0.004 sec
[au:antunit] Target: testFiltering took 0.003 sec
[au:antunit] Target: testResources took 0.002 sec
[au:antunit] Target: testReference took 0.005 sec
[au:antunit] Target: testEncoding took 0.027 sec
[au:antunit] Build File: /zonestorage/hudson/home/hudson/hudson/jobs/Ant (JDK 1.4)/workspace/trunk/src/tests/antunit/types/resources/files-test.xml
[au:antunit] Tests run: 2, Failures: 0, Errors: 0, Time elapsed: 0.029 sec
[au:antunit] Target: testEmptyFiles took 0.009 sec
[au:antunit] Target: testEmptyReference took 0 sec
[au:antunit] Build File: /zonestorage/hudson/home/hudson/hudson/jobs/Ant (JDK 1.4)/workspace/trunk/src/tests/antunit/types/resources/first-last-test.xml
[au:antunit] Tests run: 12, Failures: 0, Errors: 0, Time elapsed: 0.204 sec
[au:antunit] Target: testfirst-1 took 0.005 sec
[au:antunit] Target: testfirst6 took 0.002 sec
[au:antunit] Target: testfirst5 took 0.001 sec
[au:antunit] Target: testlast6 took 0.002 sec
[au:antunit] Target: testfirst2 took 0.001 sec
[au:antunit] Target: testlast5 took 0 sec
[au:antunit] Target: testfirst1 took 0 sec
[au:antunit] Target: testfirst0 took 0 sec
[au:antunit] Target: testlast2 took 0.003 sec
[au:antunit] Target: testlast-1 took 0.001 sec
[au:antunit] Target: testlast1 took 0.001 sec
[au:antunit] Target: testlast0 took 0.001 sec
[au:antunit] Build File: /zonestorage/hudson/home/hudson/hudson/jobs/Ant (JDK 1.4)/workspace/trunk/src/tests/antunit/types/resources/javaresource-test.xml
[au:antunit] Tests run: 3, Failures: 0, Errors: 0, Time elapsed: 2.365 sec
[au:antunit] Target: testParentFirstFalse took 0.017 sec
[au:antunit] Target: testParentFirstIsDefault took 0.034 sec
[au:antunit] Target: testUsesSystemClasspath took 0.002 sec
[au:antunit] Build File: /zonestorage/hudson/home/hudson/hudson/jobs/Ant (JDK 1.4)/workspace/trunk/src/tests/antunit/types/resources/latepath-test.xml
[au:antunit] Tests run: 1, Failures: 0, Errors: 0, Time elapsed: 0.026 sec
[au:antunit] Target: testLatePath took 0.017 sec
[au:antunit] Build File: /zonestorage/hudson/home/hudson/hudson/jobs/Ant (JDK 1.4)/workspace/trunk/src/tests/antunit/types/resources/selectors/name-test.xml
[au:antunit] Tests run: 3, Failures: 0, Errors: 0, Time elapsed: 7.406 sec
[au:antunit] Target: testPattern took 0.008 sec
[au:antunit] Target: testHandledirSep took 0.006 sec
[au:antunit] Target: testRegex took 0.003 sec
[au:antunit] Build File: /zonestorage/hudson/home/hudson/hudson/jobs/Ant (JDK 1.4)/workspace/trunk/src/tests/antunit/types/resources/selectors/readwrite-test.xml
[au:antunit] Tests run: 4, Failures: 0, Errors: 0, Time elapsed: 10.605 sec
[au:antunit] Target: testWritable took 0.171 sec
[au:antunit] Target: testAsConditions took 0.198 sec
[au:antunit] Target: testReadable took 0.01 sec
[au:antunit] Target: testUnwritable took 0.061 sec
[au:antunit] Build File: /zonestorage/hudson/home/hudson/hudson/jobs/Ant (JDK 1.4)/workspace/trunk/src/tests/antunit/types/resources/selectors/test.xml
[au:antunit] Tests run: 21, Failures: 0, Errors: 0, Time elapsed: 102.494 sec
[au:antunit] Target: testcontains took 0.168 sec
[au:antunit] Target: testand took 0.013 sec
[au:antunit] Target: testnone took 0.009 sec
[au:antunit] Target: testor took 0.008 sec
[au:antunit] Target: testnot took 0.007 sec
[au:antunit] Target: testtype took 0.011 sec
[au:antunit] Target: testmajority4 took 0.009 sec
[au:antunit] Target: testmajority3 took 0.008 sec
[au:antunit] Target: testmajority2 took 0.007 sec
[au:antunit] Target: testmajority1 took 0.007 sec
[au:antunit] Target: testinstanceofclass took 0.008 sec
[au:antunit] Target: testname2 took 0.007 sec
[au:antunit] Target: testname1 took 0.007 sec
[au:antunit] Target: testcontainsregexp took 0.011 sec
[au:antunit] Target: testexists took 0.031 sec
[au:antunit] Target: testsize took 0.007 sec
[au:antunit] Target: testcompare took 0.023 sec
[au:antunit] Target: testinstanceoftype3 took 0.01 sec
[au:antunit] Target: testinstanceoftype2 took 0.007 sec
[au:antunit] Target: testinstanceoftype1 took 0.007 sec
[au:antunit] Target: testdate took 0.008 sec
[au:antunit] Build File: /zonestorage/hudson/home/hudson/hudson/jobs/Ant (JDK 1.4)/workspace/trunk/src/tests/antunit/types/resources/test.xml
[au:antunit] Tests run: 28, Failures: 2, Errors: 0, Time elapsed: 18.959 sec
[au:antunit] Target: testfirst2 took 0.02 sec
[au:antunit] Target: testfiles3 took 0.163 sec
[au:antunit] Target: testfirst1 took 0.008 sec
[au:antunit] Target: testfileurlref took 0.082 sec
[au:antunit] Target: testfileset took 0.008 sec
[au:antunit] Target: testfiles2 took 0.028 sec
[au:antunit] Target: testfirst0 took 0.158 sec
[au:antunit] Target: testfiles1 took 0.012 sec
[au:antunit] Target: testnestedresources took 0.02 sec
[au:antunit] Target: teststring2 took 0.009 sec
[au:antunit] Target: teststring1 took 0.007 sec
[au:antunit] Target: testdirset took 0.101 sec
[au:antunit] Target: testproperty took 0.842 sec
[au:antunit] Target: testresourcesref took 0.018 sec
[au:antunit] Target: testzipentry took 0.026 sec
[au:antunit] Target: testhttpurl2 took 1.337 sec
[au:antunit] Target: testunion  FAILED
[au:antunit] 	at line 211, column 20
[au:antunit] 	Message: Assertion failed
[au:antunit] 	took 0.308 sec
[au:antunit] Target: testhttpurl1 took 0.593 sec
[au:antunit] Target: testresource took 0.008 sec
[au:antunit] Target: testpath  FAILED
[au:antunit] 	at line 163, column 20
[au:antunit] 	Message: Assertion failed
[au:antunit] 	took 0.356 sec
[au:antunit] Target: testfilelist took 0.253 sec
[au:antunit] Target: testpropertyset took 0.019 sec
[au:antunit] Target: testintersect took 0.009 sec
[au:antunit] Target: testzipfileset took 0.024 sec
[au:antunit] Target: testfileurl took 0.095 sec
[au:antunit] Target: testdifference took 0.009 sec
[au:antunit] Target: testfile took 0.01 sec
[au:antunit] Target: testjarurl took 0.022 sec
[au:antunit] Build File: /zonestorage/hudson/home/hudson/hudson/jobs/Ant (JDK 1.4)/workspace/trunk/src/tests/antunit/types/resources/tokens-test.xml
[au:antunit] Tests run: 6, Failures: 0, Errors: 0, Time elapsed: 0.039 sec
[au:antunit] Target: testSort took 0.005 sec
[au:antunit] Target: testEncoding took 0.005 sec
[au:antunit] Target: testFileTokenizer took 0.003 sec
[au:antunit] Target: testLines took 0.001 sec
[au:antunit] Target: testStringTokenizer took 0.001 sec
[au:antunit] Target: testExplicitLines took 0.002 sec
[au:antunit] Build File: /zonestorage/hudson/home/hudson/hudson/jobs/Ant (JDK 1.4)/workspace/trunk/src/tests/antunit/types/selectors/filename-test.xml
[au:antunit] Tests run: 2, Failures: 0, Errors: 2, Time elapsed: 4.796 sec
[au:antunit] Target: testRegex took 0.007 sec
[au:antunit]  caused an ERROR
[au:antunit] 	at line 24, column 29
[au:antunit] 	Message: java.lang.OutOfMemoryError
[au:antunit] 	Target: testPattern took 0.002 sec
[au:antunit]  caused an ERROR
[au:antunit] 	at line 24, column 29
[au:antunit] 	Message: java.lang.OutOfMemoryError
[au:antunit] 	
[au:antunit] Build File: /zonestorage/hudson/home/hudson/hudson/jobs/Ant (JDK 1.4)/workspace/trunk/src/tests/antunit/types/selectors/modified-test.xml
[au:antunit] Tests run: 1, Failures: 0, Errors: 0, Time elapsed: 0.126 sec
[au:antunit] Target: testUpdate took 0.025 sec
[au:antunit] Build File: /zonestorage/hudson/home/hudson/hudson/jobs/Ant (JDK 1.4)/workspace/trunk/src/tests/antunit/types/selectors/readwrite-test.xml
[au:antunit] Tests run: 4, Failures: 0, Errors: 6, Time elapsed: 11.42 sec
[au:antunit] Target: testWritable took 0.007 sec
[au:antunit]  caused an ERROR
[au:antunit] 	at line 24, column 29
[au:antunit] 	Message: java.lang.OutOfMemoryError
[au:antunit] 	Target: testAsConditions took 0.926 sec
[au:antunit]  caused an ERROR
[au:antunit] 	at line 24, column 29
[au:antunit] 	Message: java.lang.OutOfMemoryError
[au:antunit] 	Target: testReadable  caused an ERROR
[au:antunit] 	at line 30, column 38
[au:antunit] 	Message: Can not change modification date of read-only file /var/tmp/testoutput/testfile
[au:antunit] 	took 0.001 sec
[au:antunit]  caused an ERROR
[au:antunit] 	at line 24, column 29
[au:antunit] 	Message: java.lang.OutOfMemoryError
[au:antunit] 	Target: testUnwritable  caused an ERROR
[au:antunit] 	at line 30, column 38
[au:antunit] 	Message: Can not change modification date of read-only file /var/tmp/testoutput/testfile
[au:antunit] 	took 0.002 sec
[au:antunit]  caused an ERROR
[au:antunit] 	at line 24, column 29
[au:antunit] 	Message: java.lang.OutOfMemoryError
[au:antunit] 	
[au:antunit] Build File: /zonestorage/hudson/home/hudson/hudson/jobs/Ant (JDK 1.4)/workspace/trunk/src/tests/antunit/types/selectors/select-test.xml
[au:antunit] Tests run: 4, Failures: 0, Errors: 0, Time elapsed: 0.064 sec
[au:antunit] Target: testIfFalse took 0.021 sec
[au:antunit] Target: testIfNotSet took 0.004 sec
[au:antunit] Target: testIfTrue took 0.004 sec
[au:antunit] Target: testIfSet took 0.01 sec
[au:antunit] Build File: /zonestorage/hudson/home/hudson/hudson/jobs/Ant (JDK 1.4)/workspace/trunk/src/tests/antunit/types/tarfileset-test.xml
[au:antunit] Tests run: 2, Failures: 0, Errors: 2, Time elapsed: 5.034 sec
[au:antunit] Target: testMissingArchive took 0.007 sec
[au:antunit]  caused an ERROR
[au:antunit] 	at line 24, column 29
[au:antunit] 	Message: java.lang.OutOfMemoryError
[au:antunit] 	Target: testMissingArchiveDoesntMatter took 0 sec
[au:antunit]  caused an ERROR
[au:antunit] 	at line 24, column 29
[au:antunit] 	Message: java.lang.OutOfMemoryError
[au:antunit] 	
[au:antunit] Build File: /zonestorage/hudson/home/hudson/hudson/jobs/Ant (JDK 1.4)/workspace/trunk/src/tests/antunit/types/zipfileset-test.xml
[au:antunit] Tests run: 5, Failures: 0, Errors: 5, Time elapsed: 13.224 sec
[au:antunit] Target: testMissingArchive took 0.007 sec
[au:antunit]  caused an ERROR
[au:antunit] 	at line 24, column 29
[au:antunit] 	Message: java.lang.OutOfMemoryError
[au:antunit] 	Target: test-refid-check-encoding took 0.001 sec
[au:antunit]  caused an ERROR
[au:antunit] 	at line 24, column 29
[au:antunit] 	Message: java.lang.OutOfMemoryError
[au:antunit] 	Target: test-refid-modify took 0.4 sec
[au:antunit]  caused an ERROR
[au:antunit] 	at line 24, column 29
[au:antunit] 	Message: java.lang.OutOfMemoryError
[au:antunit] 	Target: test-refid-check-prefix took 0 sec
[au:antunit]  caused an ERROR
[au:antunit] 	at line 24, column 29
[au:antunit] 	Message: java.lang.OutOfMemoryError
[au:antunit] 	Target: testMissingArchiveDoesntMatter took 0.001 sec
[au:antunit]  caused an ERROR
[au:antunit] 	at line 24, column 29
[au:antunit] 	Message: java.lang.OutOfMemoryError
[au:antunit] 	

antunit-report-only:

antunit-report:

check-failed:

test:

BUILD FAILED
/zonestorage/hudson/home/hudson/hudson/jobs/Ant (JDK 1.4)/workspace/trunk/build.xml:1540:
Unit tests failed;
see /zonestorage/hudson/home/hudson/hudson/jobs/Ant (JDK 1.4)/workspace/trunk/build/testcases/reports
/ /zonestorage/hudson/home/hudson/hudson/jobs/Ant (JDK 1.4)/workspace/trunk/build/antunit/reports

Total time: 74 minutes 2 seconds
Archiving artifacts
Recording test results


Mime
View raw message