ant-notifications mailing list archives

Site index · List index
Message view « Date » · « Thread »
Top « Date » · « Thread »
From Gump Integration Build <bode...@apache.org>
Subject [GUMP@vmgump]: Project compress-antlib-test (in module ant-antlibs-sandbox) failed
Date Sat, 22 Aug 2009 04:36:50 GMT
To whom it may engage...
        
This is an automated request, but not an unsolicited one. For 
more information please visit http://gump.apache.org/nagged.html, 
and/or contact the folk at general@gump.apache.org.

Project compress-antlib-test has an issue affecting its community integration.
This issue affects 1 projects,
 and has been outstanding for 7 runs.
The current state of this project is 'Failed', with reason 'Build Failed'.
For reference only, the following projects are affected by this:
    - compress-antlib-test :  Task and Type Libraries for Apache Ant


Full details are available at:
    http://vmgump.apache.org/gump/public/ant-antlibs-sandbox/compress-antlib-test/index.html

That said, some information snippets are provided here.

The following annotations (debug/informational/warning/error messages) were provided:
 -INFO- Failed with reason build failed



The following work was performed:
http://vmgump.apache.org/gump/public/ant-antlibs-sandbox/compress-antlib-test/gump_work/build_ant-antlibs-sandbox_compress-antlib-test.html
Work Name: build_ant-antlibs-sandbox_compress-antlib-test (Type: Build)
Work ended in a state of : Failed
Elapsed: 5 secs
Command Line: /usr/lib/jvm/java-6-sun/bin/java -Djava.awt.headless=true -Xbootclasspath/p:/srv/gump/public/workspace/xml-xerces2/build/xercesImpl.jar:/srv/gump/public/workspace/xml-commons/java/external/build/xml-apis.jar
org.apache.tools.ant.Main -Dgump.merge=/srv/gump/public/gump/work/merge.xml -Dbuild.sysclasspath=only
test 
[Working Directory: /srv/gump/public/workspace/ant-antlibs-sandbox/compress]
CLASSPATH: /usr/lib/jvm/java-6-sun/lib/tools.jar:/srv/gump/public/workspace/ant-antlibs-sandbox/compress/build/ant-compress-22082009.jar:/srv/gump/public/workspace/ant/dist/lib/ant-jmf.jar:/srv/gump/public/workspace/ant/dist/lib/ant-swing.jar:/srv/gump/public/workspace/ant/dist/lib/ant-apache-resolver.jar:/srv/gump/public/workspace/ant/dist/lib/ant-apache-xalan2.jar:/srv/gump/public/workspace/ant/dist/lib/ant-trax.jar:/srv/gump/public/workspace/ant/dist/lib/ant-junit.jar:/srv/gump/public/workspace/ant/dist/lib/ant-launcher.jar:/srv/gump/public/workspace/ant/dist/lib/ant-nodeps.jar:/srv/gump/public/workspace/ant/dist/lib/ant.jar:/srv/gump/public/workspace/apache-commons/compress/target/commons-compress-1.1-SNAPSHOT.jar:/srv/gump/public/workspace/ant-antlibs/antunit/build/ant-antunit-22082009.jar:/srv/gump/public/workspace/xml-commons/java/external/build/xml-apis-ext.jar
---------------------------------------------
[au:antunit] Target: testAgainstNativeTar took 0.017 sec
[au:antunit] Build File: /srv/gump/public/workspace/ant-antlibs-sandbox/compress/src/tests/antunit/unzip-test.xml
[au:antunit] Tests run: 5, Failures: 0, Errors: 0, Time elapsed: 0.257 sec
[au:antunit] Target: testAgainstAntlibZipTask took 0.067 sec
[au:antunit] Target: testStrippingOfPathsep took 0.012 sec
[au:antunit] Target: testAgainstNativeZip took 0.045 sec
[au:antunit] Target: testAgainstCoreZipTask took 0.049 sec
[au:antunit] Target: testResourceCollection took 0.022 sec
[au:antunit] Build File: /srv/gump/public/workspace/ant-antlibs-sandbox/compress/src/tests/antunit/zip-test.xml
[au:antunit] Tests run: 10, Failures: 2, Errors: 0, Time elapsed: 0.281 sec
[au:antunit] Target: testCpioFileSet took 0.019 sec
[au:antunit] Target: testAntlibZipFileSet  FAILED
[au:antunit] 	at line 34, column 24
[au:antunit] 	Message: Assertion failed
[au:antunit] 	took 0.018 sec
[au:antunit] Target: testWithDirectories took 0.016 sec
[au:antunit] Target: testArFileSet took 0.018 sec
[au:antunit] Target: testCoreTarFileSet took 0.017 sec
[au:antunit] Target: testNoDirectoriesByDefault took 0.017 sec
[au:antunit] Target: testWithImplicitDirectories took 0.016 sec
[au:antunit] Target: testPlainFileSet took 0.017 sec
[au:antunit] Target: testCoreZipFileSet  FAILED
[au:antunit] 	at line 34, column 24
[au:antunit] 	Message: Assertion failed
[au:antunit] 	took 0.017 sec
[au:antunit] Target: testAntlibTarFileSet took 0.076 sec
[au:antunit] Build File: /srv/gump/public/workspace/ant-antlibs-sandbox/compress/src/tests/antunit/zipentry-test.xml
[au:antunit] Tests run: 3, Failures: 1, Errors: 0, Time elapsed: 0.045 sec
[au:antunit] Target: testResourceProperties  FAILED
[au:antunit] 	at line 59, column 20
[au:antunit] 	Message: Assertion failed
[au:antunit] 	took 0.01 sec
[au:antunit] Target: testUncompressSource took 0.011 sec
[au:antunit] Target: testZipSource took 0.011 sec
[au:antunit] Build File: /srv/gump/public/workspace/ant-antlibs-sandbox/compress/src/tests/antunit/zipfileset-test.xml
[au:antunit] Tests run: 7, Failures: 0, Errors: 0, Time elapsed: 0.166 sec
[au:antunit] Target: testMissingArchive took 0.008 sec
[au:antunit] Target: testUncompressSource took 0.012 sec
[au:antunit] Target: test-refid-check-encoding took 0.006 sec
[au:antunit] Target: testZipSource took 0.006 sec
[au:antunit] Target: test-refid-modify took 0.08 sec
[au:antunit] Target: test-refid-check-prefix took 0.004 sec
[au:antunit] Target: testMissingArchiveDoesntMatter took 0.003 sec

test:

BUILD FAILED
/srv/gump/public/workspace/ant-antlibs-sandbox/compress/common/build.xml:223: At least one
AntUnit test has failed.

Total time: 5 seconds
---------------------------------------------

To subscribe to this information via syndicated feeds:
- RSS: http://vmgump.apache.org/gump/public/ant-antlibs-sandbox/compress-antlib-test/rss.xml
- Atom: http://vmgump.apache.org/gump/public/ant-antlibs-sandbox/compress-antlib-test/atom.xml

============================== Gump Tracking Only ===
Produced by Gump version 2.3.
Gump Run 25000022082009, vmgump:vmgump-public:25000022082009
Gump E-mail Identifier (unique within run) #45.

--
Apache Gump
http://gump.apache.org/ [Instance: vmgump]

Mime
View raw message