ant-notifications mailing list archives

Site index · List index
Message view « Date » · « Thread »
Top « Date » · « Thread »
From Gump Integration Build <>
Subject [GUMP@vmgump]: Project compress-antlib-test (in module ant-antlibs-sandbox) failed
Date Fri, 21 Aug 2009 06:41:30 GMT
To whom it may engage...
This is an automated request, but not an unsolicited one. For 
more information please visit, 
and/or contact the folk at

Project compress-antlib-test has an issue affecting its community integration.
This issue affects 1 projects,
 and has been outstanding for 4 runs.
The current state of this project is 'Failed', with reason 'Build Failed'.
For reference only, the following projects are affected by this:
    - compress-antlib-test :  Task and Type Libraries for Apache Ant

Full details are available at:

That said, some information snippets are provided here.

The following annotations (debug/informational/warning/error messages) were provided:
 -INFO- Failed with reason build failed

The following work was performed:
Work Name: build_ant-antlibs-sandbox_compress-antlib-test (Type: Build)
Work ended in a state of : Failed
Elapsed: 6 secs
Command Line: /usr/lib/jvm/java-6-sun/bin/java -Djava.awt.headless=true -Xbootclasspath/p:/srv/gump/public/workspace/xml-xerces2/build/xercesImpl.jar:/srv/gump/public/workspace/xml-commons/java/external/build/xml-apis.jar -Dgump.merge=/srv/gump/public/gump/work/merge.xml -Dbuild.sysclasspath=only
[Working Directory: /srv/gump/public/workspace/ant-antlibs-sandbox/compress]
CLASSPATH: /usr/lib/jvm/java-6-sun/lib/tools.jar:/srv/gump/public/workspace/ant-antlibs-sandbox/compress/build/ant-compress-21082009.jar:/srv/gump/public/workspace/ant/dist/lib/ant-jmf.jar:/srv/gump/public/workspace/ant/dist/lib/ant-swing.jar:/srv/gump/public/workspace/ant/dist/lib/ant-apache-resolver.jar:/srv/gump/public/workspace/ant/dist/lib/ant-apache-xalan2.jar:/srv/gump/public/workspace/ant/dist/lib/ant-trax.jar:/srv/gump/public/workspace/ant/dist/lib/ant-junit.jar:/srv/gump/public/workspace/ant/dist/lib/ant-launcher.jar:/srv/gump/public/workspace/ant/dist/lib/ant-nodeps.jar:/srv/gump/public/workspace/ant/dist/lib/ant.jar:/srv/gump/public/workspace/apache-commons/compress/target/commons-compress-1.1-SNAPSHOT.jar:/srv/gump/public/workspace/ant-antlibs/antunit/build/ant-antunit-21082009.jar:/srv/gump/public/workspace/xml-commons/java/external/build/xml-apis-ext.jar
[au:antunit] Target: testAgainstNativeTar took 0.007 sec
[au:antunit] Build File: /srv/gump/public/workspace/ant-antlibs-sandbox/compress/src/tests/antunit/unzip-test.xml
[au:antunit] Tests run: 5, Failures: 0, Errors: 0, Time elapsed: 0.258 sec
[au:antunit] Target: testAgainstAntlibZipTask took 0.047 sec
[au:antunit] Target: testStrippingOfPathsep took 0.022 sec
[au:antunit] Target: testAgainstNativeZip took 0.007 sec
[au:antunit] Target: testAgainstCoreZipTask took 0.073 sec
[au:antunit] Target: testResourceCollection took 0.016 sec
[au:antunit] Build File: /srv/gump/public/workspace/ant-antlibs-sandbox/compress/src/tests/antunit/zip-test.xml
[au:antunit] Tests run: 7, Failures: 3, Errors: 0, Time elapsed: 0.296 sec
[au:antunit] Target: testCpioFileSet took 0.034 sec
[au:antunit] Target: testAntlibZipFileSet  FAILED
[au:antunit] 	at line 32, column 24
[au:antunit] 	Message: Assertion failed
[au:antunit] 	took 0.053 sec
[au:antunit] Target: testArFileSet  FAILED
[au:antunit] 	at line 40, column 24
[au:antunit] 	Message: Assertion failed
[au:antunit] 	took 0.03 sec
[au:antunit] Target: testCoreTarFileSet took 0.023 sec
[au:antunit] Target: testPlainFileSet took 0.027 sec
[au:antunit] Target: testCoreZipFileSet  FAILED
[au:antunit] 	at line 32, column 24
[au:antunit] 	Message: Assertion failed
[au:antunit] 	took 0.032 sec
[au:antunit] Target: testAntlibTarFileSet took 0.021 sec
[au:antunit] Build File: /srv/gump/public/workspace/ant-antlibs-sandbox/compress/src/tests/antunit/zipentry-test.xml
[au:antunit] Tests run: 3, Failures: 1, Errors: 0, Time elapsed: 0.076 sec
[au:antunit] Target: testResourceProperties  FAILED
[au:antunit] 	at line 59, column 20
[au:antunit] 	Message: Assertion failed
[au:antunit] 	took 0.021 sec
[au:antunit] Target: testUncompressSource took 0.016 sec
[au:antunit] Target: testZipSource took 0.009 sec
[au:antunit] Build File: /srv/gump/public/workspace/ant-antlibs-sandbox/compress/src/tests/antunit/zipfileset-test.xml
[au:antunit] Tests run: 7, Failures: 0, Errors: 0, Time elapsed: 0.278 sec
[au:antunit] Target: testMissingArchive took 0.022 sec
[au:antunit] Target: testUncompressSource took 0.035 sec
[au:antunit] Target: test-refid-check-encoding took 0.005 sec
[au:antunit] Target: testZipSource took 0.018 sec
[au:antunit] Target: test-refid-modify took 0.134 sec
[au:antunit] Target: test-refid-check-prefix took 0.024 sec
[au:antunit] Target: testMissingArchiveDoesntMatter took 0.004 sec


/srv/gump/public/workspace/ant-antlibs-sandbox/compress/common/build.xml:223: At least one
AntUnit test has failed.

Total time: 5 seconds

To subscribe to this information via syndicated feeds:
- RSS:
- Atom:

============================== Gump Tracking Only ===
Produced by Gump version 2.3.
Gump Run 11000021082009, vmgump:vmgump-public:11000021082009
Gump E-mail Identifier (unique within run) #71.

Apache Gump [Instance: vmgump]

View raw message