ant-dev mailing list archives

Site index · List index
Message view « Date » · « Thread »
Top « Date » · « Thread »
From Dominique Devienne <ddevie...@gmail.com>
Subject Re: [GUMP@vmgump]: Project test-ant-1.8.x (in module ant-1.8.x) failed
Date Wed, 10 Oct 2012 11:22:52 GMT
On Wed, Oct 10, 2012 at 1:01 PM, Gump Integration Build
<bodewig@apache.org> wrote:
> To whom it may engage...
>
> This is an automated request, but not an unsolicited one. For
> more information please visit http://gump.apache.org/nagged.html,
> and/or contact the folk at general@gump.apache.org.
>
> Project test-ant-1.8.x has an issue affecting its community integration.
> This issue affects 1 projects,
>  and has been outstanding for 128 runs.

FYI: JarTest and hostinfo-test failures:

    [junit] Testsuite: org.apache.tools.ant.taskdefs.JarTest
    [junit] Tests run: 30, Failures: 1, Errors: 0, Time elapsed: 51.047 sec
    [junit]
    [junit] Testcase:
testRecreateWithUpdateNewerFile(org.apache.tools.ant.taskdefs.JarTest):	FAILED
    [junit] jar has been recreated in testRecreateWithUpdateNewerFile
    [junit] junit.framework.AssertionFailedError: jar has been
recreated in testRecreateWithUpdateNewerFile
    [junit] 	at junit.framework.Assert.fail(Assert.java:57)
    [junit] 	at junit.framework.Assert.assertTrue(Assert.java:22)
    [junit] 	at junit.framework.TestCase.assertTrue(TestCase.java:192)
    [junit] 	at
org.apache.tools.ant.taskdefs.JarTest.testRecreate(JarTest.java:139)
    [junit] 	at
org.apache.tools.ant.taskdefs.JarTest.testRecreateWithUpdateNewerFile(JarTest.java:123)
    [junit] 	at sun.reflect.NativeMethodAccessorImpl.invoke0(Native Method)
    [junit] 	at
sun.reflect.NativeMethodAccessorImpl.invoke(NativeMethodAccessorImpl.java:57)
    [junit] 	at
sun.reflect.DelegatingMethodAccessorImpl.invoke(DelegatingMethodAccessorImpl.java:43)
    [junit] 	at java.lang.reflect.Method.invoke(Method.java:601)
    [junit] 	at junit.framework.TestCase.runTest(TestCase.java:176)
    [junit] 	at junit.framework.TestCase.runBare(TestCase.java:141)
    [junit] 	at junit.framework.TestResult$1.protect(TestResult.java:122)
    [junit] 	at junit.framework.TestResult.runProtected(TestResult.java:142)
    [junit] 	at junit.framework.TestResult.run(TestResult.java:125)
    [junit] 	at junit.framework.TestCase.run(TestCase.java:129)
    [junit] 	at junit.framework.TestSuite.runTest(TestSuite.java:255)
    [junit] 	at junit.framework.TestSuite.run(TestSuite.java:250)
    [junit] 	at
org.apache.tools.ant.taskdefs.optional.junit.JUnitTestRunner.run(JUnitTestRunner.java:520)
    [junit] 	at
org.apache.tools.ant.taskdefs.optional.junit.JUnitTestRunner.launch(JUnitTestRunner.java:1060)
    [junit] 	at
org.apache.tools.ant.taskdefs.optional.junit.JUnitTestRunner.main(JUnitTestRunner.java:884)
    [junit]
    [junit]
    [junit] TEST org.apache.tools.ant.taskdefs.JarTest FAILED

[au:antunit] Build File:
/srv/gump/public/workspace/ant-1.8.x/src/tests/antunit/taskdefs/hostinfo-test.xml
[au:antunit] Tests run: 5, Failures: 2, Errors: 0, Time elapsed: 2.931 sec
[au:antunit] Target: testUndef took 1.39 sec
[au:antunit] Target: testApacheNoPrefix  FAILED
[au:antunit] 	at line 70, column 22
[au:antunit] 	Message: Assertion failed
[au:antunit] 	took 0.387 sec
[au:antunit] Target: testReverse took 0.927 sec
[au:antunit] Target: testApache  FAILED
[au:antunit] 	at line 53, column 22
[au:antunit] 	Message: Assertion failed
[au:antunit] 	took 0.002 sec
[au:antunit] Target: testLocal took 0.002 sec

---------------------------------------------------------------------
To unsubscribe, e-mail: dev-unsubscribe@ant.apache.org
For additional commands, e-mail: dev-help@ant.apache.org


Mime
View raw message