ant-dev mailing list archives

Site index · List index
Message view « Date » · « Thread »
Top « Date » · « Thread »
From "Peter Reilly" <peter.kitt.rei...@gmail.com>
Subject Re: [GUMP@vmgump]: Project test-ant-no-xerces (in module ant) failed
Date Thu, 25 Oct 2007 15:02:08 GMT
Caused:
    [junit] ------------- Standard Output ---------------
    [junit] /srv/gump/public/workspace/ant/src/etc/testcases/taskdefs/optional/junit.xml:194:
Compile failed; see the compiler error output for details.)
    [junit] ------------- ---------------- ---------------
    [junit] Testcase:
testFailureRecorder(org.apache.tools.ant.taskdefs.optional.junit.JUnitTaskTest):	Caused
an ERROR
    [junit] The following error occurred while executing this line:
    [junit] /srv/gump/public/workspace/ant/src/etc/testcases/taskdefs/optional/junit.xml:194:
Compile failed; see the compiler error output for details.

Continuation...

    [junit] /srv/gump/public/workspace/ant/src/etc/testcases/taskdefs/optional/junit.xml:223:
The following error occurred while executing this line:
    [junit] /srv/gump/public/workspace/ant/src/etc/testcases/taskdefs/optional/junit.xml:194:
Compile failed; see the compiler error output for details.
    [junit] Caused by:
/srv/gump/public/workspace/ant/src/etc/testcases/taskdefs/optional/junit.xml:194:
Compile failed; see the compiler error output for details.
    [junit] --- Nested Exception ---
    [junit] /srv/gump/public/workspace/ant/src/etc/testcases/taskdefs/optional/junit.xml:194:
Compile failed; see the compiler error output for details.
    [junit]
    [junit]
    [junit] Test
org.apache.tools.ant.taskdefs.optional.junit.JUnitTaskTest FAILED


On 10/25/07, Gump Integration Build <general@gump.apache.org> wrote:
> To whom it may engage...
>
> This is an automated request, but not an unsolicited one. For
> more information please visit http://gump.apache.org/nagged.html,
> and/or contact the folk at general@gump.apache.org.
>
> Project test-ant-no-xerces has an issue affecting its community integration.
> This issue affects 1 projects,
>  and has been outstanding for 54 runs.
> The current state of this project is 'Failed', with reason 'Build Failed'.
> For reference only, the following projects are affected by this:
>     - test-ant-no-xerces :  Java based build tool
>
>
> Full details are available at:
>     http://vmgump.apache.org/gump/public/ant/test-ant-no-xerces/index.html
>
> That said, some information snippets are provided here.
>
> The following annotations (debug/informational/warning/error messages) were provided:
>  -INFO- Failed with reason build failed
>
>
>
> The following work was performed:
> http://vmgump.apache.org/gump/public/ant/test-ant-no-xerces/gump_work/build_ant_test-ant-no-xerces.html
> Work Name: build_ant_test-ant-no-xerces (Type: Build)
> Work ended in a state of : Failed
> Elapsed: 12 mins 13 secs
> Command Line: /usr/lib/jvm/java-1.5.0-sun/bin/java -Djava.awt.headless=true org.apache.tools.ant.Main
-Dgump.merge=/srv/gump/public/gump/work/merge.xml -Dbuild.sysclasspath=only -Dtest.haltonfailure=false
-Dant.home=/srv/gump/public/workspace/ant/dist run-tests
> [Working Directory: /srv/gump/public/workspace/ant]
> CLASSPATH: /usr/lib/jvm/java-1.5.0-sun/lib/tools.jar:/srv/gump/public/workspace/ant/build/testcases:/srv/gump/public/workspace/ant/src/tests/junit:/srv/gump/public/workspace/ant/src/etc/testcases:/srv/gump/public/workspace/ant/build/lib/ant-stylebook.jar:/srv/gump/public/workspace/ant/build/lib/ant-jmf.jar:/srv/gump/public/workspace/ant/build/lib/ant-swing.jar:/srv/gump/public/workspace/ant/build/lib/ant-junit.jar:/srv/gump/public/workspace/ant/build/lib/ant-apache-resolver.jar:/srv/gump/public/workspace/ant/build/lib/ant-javamail.jar:/srv/gump/public/workspace/ant/build/lib/ant-apache-bcel.jar:/srv/gump/public/workspace/ant/build/lib/ant-apache-regexp.jar:/srv/gump/public/workspace/ant/build/lib/ant-trax.jar:/srv/gump/public/workspace/ant/build/lib/ant-commons-net.jar:/srv/gump/public/workspace/ant/build/lib/ant-jsch.jar:/srv/gump/public/workspace/ant/build/lib/ant-apache-log4j.jar:/srv/gump/public/workspace/ant/build/lib/ant-antlr.jar:/srv/gump/public/workspace/ant/build/
 li
>  b/ant-commons-logging.jar:/srv/gump/public/workspace/ant/build/lib/ant-jdepend.jar:/srv/gump/public/workspace/ant/build/lib/ant-apache-bsf.jar:/srv/gump/public/workspace/ant/build/lib/ant-launcher.jar:/srv/gump/public/workspace/ant/build/lib/ant-nodeps.jar:/srv/gump/public/workspace/ant/build/lib/ant-apache-oro.jar:/srv/gump/public/workspace/ant/build/lib/ant.jar:/srv/gump/public/workspace/ant/build/lib/ant-jai.jar:/srv/gump/packages/antlr-2.7.6/antlr.jar:/srv/gump/public/workspace/apache-commons/logging/target/commons-logging-25102007.jar:/srv/gump/public/workspace/apache-commons/logging/target/commons-logging-api-25102007.jar:/srv/gump/public/workspace/apache-commons/net/dist/commons-net-25102007.jar:/srv/gump/packages/jaf-1.1ea/activation.jar:/srv/gump/public/workspace/jakarta-bcel/target/bcel-5.3-SNAPSHOT.jar:/srv/gump/public/workspace/jakarta-bsf/build/lib/bsf.jar:/srv/gump/public/workspace/logging-log4j-12/dist/lib/log4j-25102007.jar:/srv/gump/public/workspace/jakart
 a-
>  oro/jakarta-oro-25102007.jar:/srv/gump/public/workspace/jakarta-regexp/build/jakarta-regexp-25102007.jar:/srv/gump/public/workspace/jakarta-servletapi-4/lib/servlet.jar:/srv/gump/packages/javamail-1.4/mail.jar:/srv/gump/packages/javamail-1.4/lib/mailapi.jar:/srv/gump/packages/jdepend-2.6/lib/jdepend.jar:/srv/gump/packages/jsch/jsch-0.1.28.jar:/srv/gump/public/workspace/xml-stylebook/bin/stylebook-1.0-b3_xalan-2.jar:/srv/gump/public/workspace/ant-antlibs/antunit/build/ant-antunit-25102007.jar:/srv/gump/public/workspace/junit/dist/junit-25102007.jar:/srv/gump/public/workspace/jakarta-tomcat-4.0/dist/common/lib/jasper-compiler.jar:/srv/gump/public/workspace/jakarta-tomcat-4.0/dist/common/lib/jasper-runtime.jar:/srv/gump/public/workspace/xml-commons/java/build/which.jar:/srv/gump/public/workspace/rhino/build/rhino_25102007/js.jar:/srv/gump/packages/bsh-2.0b4/bsh-commands-2.0b4.jar:/srv/gump/packages/bsh-2.0b4/bsh-classpath-2.0b4.jar:/srv/gump/packages/bsh-2.0b4/bsh-core-2.0b4.
 ja
>  r:/srv/gump/packages/bsh-2.0b4/bsh-bsf-2.0b4.jar:/srv/gump/packages/bsh-2.0b4/bsh-2.0b4.jar:/srv/gump/packages/bsh-2.0b4/bsh-reflect-2.0b4.jar:/srv/gump/packages/bsh-2.0b4/bsh-util-2.0b4.jar:/srv/gump/public/workspace/apache-commons/codec/dist/commons-codec-25102007.jar
> ---------------------------------------------
>         at org.apache.tools.ant.Project.executeTargets(Project.java:1176)
>         at org.apache.tools.ant.Main.runBuild(Main.java:758)
>         at org.apache.tools.ant.Main.startAnt(Main.java:217)
>         at org.apache.tools.ant.Main.start(Main.java:179)
>         at org.apache.tools.ant.Main.main(Main.java:268)
>
> check-failed:
> java.io.FileNotFoundException: /srv/gump/public/workspace/ant/src/etc/testcases/taskdefs/optional/out/FailedTests.java
(No such file or directory)
>         at java.io.FileOutputStream.open(Native Method)
>         at java.io.FileOutputStream.<init>(FileOutputStream.java:179)
>         at java.io.FileOutputStream.<init>(FileOutputStream.java:131)
>         at org.apache.tools.ant.taskdefs.optional.junit.FailureRecorder.writeJavaClass(FailureRecorder.java:248)
>         at org.apache.tools.ant.taskdefs.optional.junit.FailureRecorder.taskFinished(FailureRecorder.java:410)
>         at org.apache.tools.ant.Project.fireTaskFinished(Project.java:2117)
>         at org.apache.tools.ant.Task.perform(Task.java:364)
>         at org.apache.tools.ant.Target.execute(Target.java:354)
>         at org.apache.tools.ant.Target.performTasks(Target.java:379)
>         at org.apache.tools.ant.Project.executeSortedTargets(Project.java:1324)
>         at org.apache.tools.ant.Project.executeTarget(Project.java:1293)
>         at org.apache.tools.ant.helper.DefaultExecutor.executeTargets(DefaultExecutor.java:41)
>         at org.apache.tools.ant.Project.executeTargets(Project.java:1176)
>         at org.apache.tools.ant.Main.runBuild(Main.java:758)
>         at org.apache.tools.ant.Main.startAnt(Main.java:217)
>         at org.apache.tools.ant.Main.start(Main.java:179)
>         at org.apache.tools.ant.Main.main(Main.java:268)
>
> run-tests:
> java.io.FileNotFoundException: /srv/gump/public/workspace/ant/src/etc/testcases/taskdefs/optional/out/FailedTests.java
(No such file or directory)
>         at java.io.FileOutputStream.open(Native Method)
>         at java.io.FileOutputStream.<init>(FileOutputStream.java:179)
>         at java.io.FileOutputStream.<init>(FileOutputStream.java:131)
>         at org.apache.tools.ant.taskdefs.optional.junit.FailureRecorder.writeJavaClass(FailureRecorder.java:248)
>         at org.apache.tools.ant.taskdefs.optional.junit.FailureRecorder.taskFinished(FailureRecorder.java:410)
>         at org.apache.tools.ant.Project.fireTaskFinished(Project.java:2117)
>         at org.apache.tools.ant.Task.perform(Task.java:364)
>         at org.apache.tools.ant.Target.execute(Target.java:354)
>         at org.apache.tools.ant.Target.performTasks(Target.java:379)
>         at org.apache.tools.ant.Project.executeSortedTargets(Project.java:1324)
>         at org.apache.tools.ant.Project.executeTarget(Project.java:1293)
>         at org.apache.tools.ant.helper.DefaultExecutor.executeTargets(DefaultExecutor.java:41)
>         at org.apache.tools.ant.Project.executeTargets(Project.java:1176)
>         at org.apache.tools.ant.Main.runBuild(Main.java:758)
>         at org.apache.tools.ant.Main.startAnt(Main.java:217)
>         at org.apache.tools.ant.Main.start(Main.java:179)
>         at org.apache.tools.ant.Main.main(Main.java:268)
>
> BUILD FAILED
> /srv/gump/public/workspace/ant/build.xml:1584: Unit tests failed
>
> Total time: 12 minutes 11 seconds
> ---------------------------------------------
>
> To subscribe to this information via syndicated feeds:
> - RSS: http://vmgump.apache.org/gump/public/ant/test-ant-no-xerces/rss.xml
> - Atom: http://vmgump.apache.org/gump/public/ant/test-ant-no-xerces/atom.xml
>
> ============================== Gump Tracking Only ===
> Produced by Gump version 2.3.
> Gump Run 12000025102007, vmgump:vmgump-public:12000025102007
> Gump E-mail Identifier (unique within run) #38.
>
> --
> Apache Gump
> http://gump.apache.org/ [Instance: vmgump]
>
> ---------------------------------------------------------------------
> To unsubscribe, e-mail: dev-unsubscribe@ant.apache.org
> For additional commands, e-mail: dev-help@ant.apache.org
>
>

---------------------------------------------------------------------
To unsubscribe, e-mail: dev-unsubscribe@ant.apache.org
For additional commands, e-mail: dev-help@ant.apache.org


Mime
View raw message