ant-dev mailing list archives

Site index · List index
Message view « Date » · « Thread »
Top « Date » · « Thread »
From Matt Benson <gudnabr...@yahoo.com>
Subject Re: [GUMP@vmgump]: Project svn-antlib-test (in module ant-antlibs) failed
Date Mon, 27 Aug 2007 14:15:43 GMT
BTW, is this stuff truly broken and needs attention,
or is this ongoing breakage due to some (unfixable?)
Gump weirdness?

-Matt

--- Gump Integration Build <general@gump.apache.org>
wrote:

> To whom it may engage...
>         
> This is an automated request, but not an unsolicited
> one. For 
> more information please visit
> http://gump.apache.org/nagged.html, 
> and/or contact the folk at general@gump.apache.org.
> 
> Project svn-antlib-test has an issue affecting its
> community integration.
> This issue affects 1 projects,
>  and has been outstanding for 133 runs.
> The current state of this project is 'Failed', with
> reason 'Build Failed'.
> For reference only, the following projects are
> affected by this:
>     - svn-antlib-test :  Task and Type Libraries for
> Apache Ant
> 
> 
> Full details are available at:
>    
>
http://vmgump.apache.org/gump/public/ant-antlibs/svn-antlib-test/index.html
> 
> That said, some information snippets are provided
> here.
> 
> The following annotations
> (debug/informational/warning/error messages) were
> provided:
>  -DEBUG- Dependency on ant-testutil exists, no need
> to add for property ant-testutil.jar.
>  -INFO- Failed with reason build failed
> 
> 
> 
> The following work was performed:
>
http://vmgump.apache.org/gump/public/ant-antlibs/svn-antlib-test/gump_work/build_ant-antlibs_svn-antlib-test.html
> Work Name: build_ant-antlibs_svn-antlib-test (Type:
> Build)
> Work ended in a state of : Failed
> Elapsed: 2 mins 36 secs
> Command Line: /usr/lib/jvm/java-1.5.0-sun/bin/java
> -Djava.awt.headless=true
>
-Xbootclasspath/p:/srv/gump/public/workspace/xml-xerces2/build/xercesImpl.jar:/srv/gump/public/workspace/xml-commons/java/external/build/xml-apis.jar
> org.apache.tools.ant.Main
> -Dgump.merge=/srv/gump/public/gump/work/merge.xml
> -Dbuild.sysclasspath=only
>
-Dant-testutil.jar=/srv/gump/public/workspace/ant/build/lib/ant-testutil.jar
> test 
> [Working Directory:
> /srv/gump/public/workspace/ant-antlibs/svn]
> CLASSPATH:
>
/usr/lib/jvm/java-1.5.0-sun/lib/tools.jar:/srv/gump/public/workspace/ant-antlibs/svn/build/test-classes:/srv/gump/public/workspace/ant/dist/lib/ant-jmf.jar:/srv/gump/public/workspace/ant/dist/lib/ant-swing.jar:/srv/gump/public/workspace/ant/dist/lib/ant-apache-resolver.jar:/srv/gump/public/workspace/ant/dist/lib/ant-trax.jar:/srv/gump/public/workspace/ant/dist/lib/ant-junit.jar:/srv/gump/public/workspace/ant/dist/lib/ant-launcher.jar:/srv/gump/public/workspace/ant/dist/lib/ant-nodeps.jar:/srv/gump/public/workspace/ant/dist/lib/ant.jar:/srv/gump/public/workspace/ant/build/lib/ant-testutil.jar:/srv/gump/public/workspace/junit/dist/junit-27082007.jar:/srv/gump/public/workspace/ant-antlibs/svn/build/ant-svn-27082007.jar:/srv/gump/public/workspace/xml-commons/java/external/build/xml-apis-ext.jar
> ---------------------------------------------
>     [junit] 	at
> junit.framework.TestSuite.run(TestSuite.java:227)
>     [junit] 	at
>
org.junit.internal.runners.JUnit38ClassRunner.run(JUnit38ClassRunner.java:80)
>     [junit] 	at
>
junit.framework.JUnit4TestAdapter.run(JUnit4TestAdapter.java:39)
>     [junit] 	at
>
org.apache.tools.ant.taskdefs.optional.junit.JUnitTestRunner.run(JUnitTestRunner.java:420)
>     [junit] 	at
>
org.apache.tools.ant.taskdefs.optional.junit.JUnitTestRunner.launch(JUnitTestRunner.java:911)
>     [junit] 	at
>
org.apache.tools.ant.taskdefs.optional.junit.JUnitTestRunner.main(JUnitTestRunner.java:743)
>     [junit] 
>     [junit] Testcase: testDiffWithImplicitTrunk took
> 56.061 sec
>     [junit] 	FAILED
>     [junit] null
>     [junit] junit.framework.AssertionFailedError:
> null
>     [junit] 	at
> junit.framework.Assert.fail(Assert.java:47)
>     [junit] 	at
> junit.framework.Assert.assertTrue(Assert.java:20)
>     [junit] 	at
> junit.framework.Assert.assertTrue(Assert.java:27)
>     [junit] 	at
>
org.apache.ant.svn.SvnTagDiffTest.assertModified(SvnTagDiffTest.java:110)
>     [junit] 	at
>
org.apache.ant.svn.SvnTagDiffTest.assertDiffWithTrunk(SvnTagDiffTest.java:63)
>     [junit] 	at
>
org.apache.ant.svn.SvnTagDiffTest.testDiffWithImplicitTrunk(SvnTagDiffTest.java:57)
>     [junit] 	at
> sun.reflect.NativeMethodAccessorImpl.invoke0(Native
> Method)
>     [junit] 	at
>
sun.reflect.NativeMethodAccessorImpl.invoke(NativeMethodAccessorImpl.java:39)
>     [junit] 	at
>
sun.reflect.DelegatingMethodAccessorImpl.invoke(DelegatingMethodAccessorImpl.java:25)
>     [junit] 	at
> java.lang.reflect.Method.invoke(Method.java:585)
>     [junit] 	at
> junit.framework.TestCase.runTest(TestCase.java:168)
>     [junit] 	at
> junit.framework.TestCase.runBare(TestCase.java:134)
>     [junit] 	at
>
junit.framework.TestResult$1.protect(TestResult.java:110)
>     [junit] 	at
>
junit.framework.TestResult.runProtected(TestResult.java:128)
>     [junit] 	at
> junit.framework.TestResult.run(TestResult.java:113)
>     [junit] 	at
> junit.framework.TestCase.run(TestCase.java:124)
>     [junit] 	at
>
junit.framework.TestSuite.runTest(TestSuite.java:232)
>     [junit] 	at
> junit.framework.TestSuite.run(TestSuite.java:227)
>     [junit] 	at
>
org.junit.internal.runners.JUnit38ClassRunner.run(JUnit38ClassRunner.java:80)
>     [junit] 	at
>
junit.framework.JUnit4TestAdapter.run(JUnit4TestAdapter.java:39)
>     [junit] 	at
>
org.apache.tools.ant.taskdefs.optional.junit.JUnitTestRunner.run(JUnitTestRunner.java:420)
>     [junit] 	at
>
org.apache.tools.ant.taskdefs.optional.junit.JUnitTestRunner.launch(JUnitTestRunner.java:911)
>     [junit] 	at
>
org.apache.tools.ant.taskdefs.optional.junit.JUnitTestRunner.main(JUnitTestRunner.java:743)
>     [junit] 
>     [junit] TEST org.apache.ant.svn.SvnTagDiffTest
> FAILED
>     [junit] Tests FAILED
> 
> setup-for-antunit-tests:
> 
> ready-to-test-with-antunit:
> 
> antunit-test:
> 
> test:
> 
> BUILD FAILED
>
/srv/gump/public/workspace/ant-antlibs/svn/common/build.xml:214:
> At least one JUnit test has failed.
> 
> Total time: 2 minutes 36 seconds
> ---------------------------------------------
> 
> To subscribe to this information via syndicated
> feeds:
> - RSS:
>
http://vmgump.apache.org/gump/public/ant-antlibs/svn-antlib-test/rss.xml
> - Atom:
>
http://vmgump.apache.org/gump/public/ant-antlibs/svn-antlib-test/atom.xml
> 
> ============================== Gump Tracking Only
> ===
> Produced by Gump version 2.3.
> Gump Run 37000027082007,
> vmgump:vmgump-public:37000027082007
> Gump E-mail Identifier (unique within run) #10.
> 
> --
> Apache Gump
> http://gump.apache.org/ [Instance: vmgump]
> 
>
---------------------------------------------------------------------
> To unsubscribe, e-mail:
> dev-unsubscribe@ant.apache.org
> For additional commands, e-mail:
> dev-help@ant.apache.org
> 
> 



      ____________________________________________________________________________________
Shape Yahoo! in your own image.  Join our Network Research Panel today!   http://surveylink.yahoo.com/gmrs/yahoo_panel_invite.asp?a=7




---------------------------------------------------------------------
To unsubscribe, e-mail: dev-unsubscribe@ant.apache.org
For additional commands, e-mail: dev-help@ant.apache.org


Mime
View raw message