ant-dev mailing list archives

Site index · List index
Message view « Date » · « Thread »
Top « Date » · « Thread »
From Martijn Kruithof <...@apache.org>
Subject Re: svn commit: r381467 - in /ant/core/trunk: ./ docs/manual/ docs/manual/OptionalTasks/ src/main/org/apache/tools/ant/ src/main/org/apache/tools/ant/taskdefs/optional/junit/ xdocs/
Date Tue, 28 Feb 2006 15:38:01 GMT

Jesse Glick schreef:

> If it was working before it _should_ work the same way now (I hope!), 
> especially if both IDEA and Eclipse launch Ant out of VM (which I 
> think they do but I'm not positive).
>
> -J.
>

Hi

For eclipse it was NOT working before (at least not without configuring 
junit to be available to ant in the preferences screen) Now it also work 
by adding an classpath entry referring to the junit installation in the 
build file.

Martijn

=========================================================

Eclipse 3.1.1 / ant 1.6.5 (default eclipse version)

Buildfile: D:\data\eclipseworkspace\cash\build.xml
clean:
   [delete] Deleting directory D:\data\eclipseworkspace\cash\classes
   [delete] Deleting directory D:\data\eclipseworkspace\cash\testclasses
   [delete] Deleting directory D:\data\eclipseworkspace\cash\testreports
classes:
    [mkdir] Created dir: D:\data\eclipseworkspace\cash\classes
    [javac] Compiling 9 source files to 
D:\data\eclipseworkspace\cash\classes
testclasses:
    [mkdir] Created dir: D:\data\eclipseworkspace\cash\testclasses
    [javac] Compiling 3 source files to 
D:\data\eclipseworkspace\cash\testclasses
runtest:
    [mkdir] Created dir: D:\data\eclipseworkspace\cash\testreports

BUILD FAILED
D:\data\eclipseworkspace\cash\build.xml:34: Could not create task or 
type of type: junit.

Ant could not find the task or a class this task relies upon.

This is common and has a number of causes; the usual
solutions are to read the manual pages then download and
install needed JAR files, or fix the build file:
 - You have misspelt 'junit'.
   Fix: check your spelling.
 - The task needs an external JAR file to execute
     and this is not found at the right place in the classpath.
   Fix: check the documentation for dependencies.
   Fix: declare the task.
 - The task is an Ant optional task and the JAR file and/or libraries
     implementing the functionality were not found at the time you
     yourself built your installation of Ant from the Ant sources.
   Fix: Look in the ANT_HOME/lib for the 'ant-' JAR corresponding to the
     task and make sure it contains more than merely a META-INF/MANIFEST.MF.
     If all it contains is the manifest, then rebuild Ant with the needed
     libraries present in ${ant.home}/lib/optional/ , or alternatively,
     download a pre-built release version from apache.org
 - The build file was written for a later version of Ant
   Fix: upgrade to at least the latest release version of Ant
 - The task is not an Ant core or optional task
     and needs to be declared using <taskdef>.
 - You are attempting to use a task defined using
    <presetdef> or <macrodef> but have spelt wrong or not
   defined it at the point of use

Remember that for JAR files to be visible to Ant tasks implemented
in ANT_HOME/lib, the files must be in the same directory or on the
classpath

Please neither file bug reports on this problem, nor email the
Ant mailing lists, until all of these causes have been explored,
as this is not an Ant bug.

Total time: 2 seconds

=========================================================

eclipse 3.1.1 / dist-lite of current version eclipse-plug-inified:

Buildfile: D:\data\eclipseworkspace\cash\build.xml
clean:
   [delete] Deleting directory D:\data\eclipseworkspace\cash\classes
   [delete] Deleting directory D:\data\eclipseworkspace\cash\testclasses
   [delete] Deleting directory D:\data\eclipseworkspace\cash\testreports
classes:
    [mkdir] Created dir: D:\data\eclipseworkspace\cash\classes
    [javac] Compiling 9 source files to 
D:\data\eclipseworkspace\cash\classes
testclasses:
    [mkdir] Created dir: D:\data\eclipseworkspace\cash\testclasses
    [javac] Compiling 3 source files to 
D:\data\eclipseworkspace\cash\testclasses
runtest:
    [mkdir] Created dir: D:\data\eclipseworkspace\cash\testreports
    [junit] Test jkf.cash.stockSql.DbConnectionTest FAILED
    [junit] Test jkf.cash.stockSql.SecurityImplTest FAILED
all:
BUILD SUCCESSFUL
Total time: 3 seconds

=========================================================






---------------------------------------------------------------------
To unsubscribe, e-mail: dev-unsubscribe@ant.apache.org
For additional commands, e-mail: dev-help@ant.apache.org


Mime
View raw message