ant-dev mailing list archives

Site index · List index
Message view « Date » · « Thread »
Top « Date » · « Thread »
From <Jan.Mate...@rzf.fin-nrw.de>
Subject AW: [GUMP@vmgump]: Project test-ant-no-xerces (in module ant) failed
Date Thu, 03 Nov 2005 13:49:01 GMT
    [junit] Testsuite: org.apache.tools.ant.IncludeTest
    [junit] Tests run: 12, Failures: 0, Errors: 2, Time elapsed: 0.164 sec

    [junit] Testcase: test2(org.apache.tools.ant.IncludeTest):	Caused an ERROR
    [junit] java.io.FileNotFoundException: /x1/gump/public/workspace/ant/src/etc/testcases/core/include/frag#ment/file:include.inc
(No such file or directory)
    [junit] java.io.FileNotFoundException: /x1/gump/public/workspace/ant/src/etc/testcases/core/include/frag#ment/file:include.inc
(No such file or directory)


    [junit] Testcase: testWithSpaceInclude(org.apache.tools.ant.IncludeTest):	Caused an ERROR
    [junit] java.io.FileNotFoundException: /x1/gump/public/workspace/ant/src/etc/testcases/core/include/with
space/file:include.inc (No such file or directory)
    [junit] java.io.FileNotFoundException: /x1/gump/public/workspace/ant/src/etc/testcases/core/include/with
space/file:include.inc (No such file or directory)


    [junit] Testcase: testNoSuffix(org.apache.tools.ant.taskdefs.LibrariesTest):	Caused an
ERROR
    [junit] Download count mismatch: expected 1 but fetched 0
    [junit] /x1/gump/public/workspace/ant/src/etc/testcases/taskdefs/libraries.xml:329: Download
count mismatch: expected 1 but fetched 0
    [junit] 	at org.apache.tools.ant.taskdefs.repository.AssertDownloaded.afterFetched(AssertDownloaded.java:75)


    [junit] Testcase: testResourceSelectorSimple(org.apache.tools.ant.types.selectors.ModifiedSelectorTest):
Caused an ERROR
    [junit] restrict doesn't support the nested "modified" element.
    [junit] /x1/gump/public/workspace/ant/src/etc/testcases/types/selectors.xml:266: restrict
doesn't support the nested "modified" element.
    [junit] 	at org.apache.tools.ant.UnknownElement.handleChildren(UnknownElement.java:345)


 

>-----Urspr√ľngliche Nachricht-----
>Von: Gump Integration Build [mailto:general@gump.apache.org] 
>Gesendet: Donnerstag, 3. November 2005 14:20
>An: dev@ant.apache.org
>Betreff: [GUMP@vmgump]: Project test-ant-no-xerces (in module 
>ant) failed
>Full details are available at:
>    
>http://vmgump.apache.org/gump/public/ant/test-ant-no-xerces/index.html

---------------------------------------------------------------------
To unsubscribe, e-mail: dev-unsubscribe@ant.apache.org
For additional commands, e-mail: dev-help@ant.apache.org


Mime
View raw message