ant-dev mailing list archives

Site index · List index
Message view « Date » · « Thread »
Top « Date » · « Thread »
From bugzi...@apache.org
Subject DO NOT REPLY [Bug 34734] New: - The <get src=...> target fails with java.lang.ArrayIndexOutOfBoundsException
Date Wed, 04 May 2005 10:44:37 GMT
DO NOT REPLY TO THIS EMAIL, BUT PLEASE POST YOUR BUG·
RELATED COMMENTS THROUGH THE WEB INTERFACE AVAILABLE AT
<http://issues.apache.org/bugzilla/show_bug.cgi?id=34734>.
ANY REPLY MADE TO THIS MESSAGE WILL NOT BE COLLECTED AND·
INSERTED IN THE BUG DATABASE.

http://issues.apache.org/bugzilla/show_bug.cgi?id=34734

           Summary: The <get src=...> target fails with
                    java.lang.ArrayIndexOutOfBoundsException
           Product: Ant
           Version: 1.6.3
          Platform: PC
        OS/Version: Windows XP
            Status: NEW
          Severity: normal
          Priority: P1
         Component: Core tasks
        AssignedTo: dev@ant.apache.org
        ReportedBy: steveh@nesstar.com


The <get src=...> target fails with java.lang.ArrayIndexOutOfBoundsException.

Here's the build

<get src="${jre.url}"
   dest="${zip.dir}/${jre.name}"
   username="${web.downloadid}"
   password="${web.downloadpassword}"
   usetimestamp="true"
/>

Here's a full stack trace:

BUILD FAILED
/usr/local/faster/ejbserver/build.xml:2339: The following error occurred while
executing this line:
/usr/local/faster/ejbserver/build.xml:2364:
java.lang.ArrayIndexOutOfBoundsException: 28
        at
org.apache.tools.ant.ProjectHelper.addLocationToBuildException(ProjectHelper.java:539)
        at org.apache.tools.ant.taskdefs.Ant.execute(Ant.java:384)
        at org.apache.tools.ant.taskdefs.CallTarget.execute(CallTarget.java:107)
        at org.apache.tools.ant.UnknownElement.execute(UnknownElement.java:275)
        at org.apache.tools.ant.Task.perform(Task.java:364)
        at org.apache.tools.ant.Target.execute(Target.java:341)
        at org.apache.tools.ant.Target.performTasks(Target.java:369)
        at org.apache.tools.ant.Project.executeSortedTargets(Project.java:1216)
        at org.apache.tools.ant.Project.executeTarget(Project.java:1185)
        at
org.apache.tools.ant.helper.DefaultExecutor.executeTargets(DefaultExecutor.java:40)
        at org.apache.tools.ant.Project.executeTargets(Project.java:1068)
        at org.apache.tools.ant.Main.runBuild(Main.java:668)
        at org.apache.tools.ant.Main.startAnt(Main.java:187)
        at org.apache.tools.ant.launch.Launcher.run(Launcher.java:246)
        at org.apache.tools.ant.launch.Launcher.main(Launcher.java:67)
Caused by: /usr/local/faster/ejbserver/build.xml:2364:
java.lang.ArrayIndexOutOfBoundsException: 28
        at org.apache.tools.ant.Task.perform(Task.java:373)
        at org.apache.tools.ant.Target.execute(Target.java:341)
        at org.apache.tools.ant.Target.performTasks(Target.java:369)
        at org.apache.tools.ant.Project.executeSortedTargets(Project.java:1216)
        at
org.apache.tools.ant.helper.SingleCheckExecutor.executeTargets(SingleCheckExecutor.java:37)
        at org.apache.tools.ant.Project.executeTargets(Project.java:1068)
        at org.apache.tools.ant.taskdefs.Ant.execute(Ant.java:382)
        ... 13 more
Caused by: java.lang.ArrayIndexOutOfBoundsException: 28
        at org.apache.tools.ant.taskdefs.Get$Base64Converter.encode(Get.java:379)
        at org.apache.tools.ant.taskdefs.Get.doGet(Get.java:152)
        at org.apache.tools.ant.taskdefs.Get.execute(Get.java:76)
        at org.apache.tools.ant.UnknownElement.execute(UnknownElement.java:275)
        at org.apache.tools.ant.Task.perform(Task.java:364)
        ... 19 more
--- Nested Exception ---
/usr/local/faster/ejbserver/build.xml:2364:
java.lang.ArrayIndexOutOfBoundsException: 28
        at org.apache.tools.ant.Task.perform(Task.java:373)
        at org.apache.tools.ant.Target.execute(Target.java:341)
        at org.apache.tools.ant.Target.performTasks(Target.java:369)
        at org.apache.tools.ant.Project.executeSortedTargets(Project.java:1216)
        at
org.apache.tools.ant.helper.SingleCheckExecutor.executeTargets(SingleCheckExecutor.java:37)
        at org.apache.tools.ant.Project.executeTargets(Project.java:1068)
        at org.apache.tools.ant.taskdefs.Ant.execute(Ant.java:382)
        at org.apache.tools.ant.taskdefs.CallTarget.execute(CallTarget.java:107)
        at org.apache.tools.ant.UnknownElement.execute(UnknownElement.java:275)
        at org.apache.tools.ant.Task.perform(Task.java:364)
        at org.apache.tools.ant.Target.execute(Target.java:341)
        at org.apache.tools.ant.Target.performTasks(Target.java:369)
        at org.apache.tools.ant.Project.executeSortedTargets(Project.java:1216)
        at org.apache.tools.ant.Project.executeTarget(Project.java:1185)
        at
org.apache.tools.ant.helper.DefaultExecutor.executeTargets(DefaultExecutor.java:40)
        at org.apache.tools.ant.Project.executeTargets(Project.java:1068)
        at org.apache.tools.ant.Main.runBuild(Main.java:668)
        at org.apache.tools.ant.Main.startAnt(Main.java:187)
        at org.apache.tools.ant.launch.Launcher.run(Launcher.java:246)
        at org.apache.tools.ant.launch.Launcher.main(Launcher.java:67)
Caused by: java.lang.ArrayIndexOutOfBoundsException: 28
        at org.apache.tools.ant.taskdefs.Get$Base64Converter.encode(Get.java:379)
        at org.apache.tools.ant.taskdefs.Get.doGet(Get.java:152)
        at org.apache.tools.ant.taskdefs.Get.execute(Get.java:76)
        at org.apache.tools.ant.UnknownElement.execute(UnknownElement.java:275)
        at org.apache.tools.ant.Task.perform(Task.java:364)
        ... 19 more
--- Nested Exception ---
java.lang.ArrayIndexOutOfBoundsException: 28
        at org.apache.tools.ant.taskdefs.Get$Base64Converter.encode(Get.java:379)
        at org.apache.tools.ant.taskdefs.Get.doGet(Get.java:152)
        at org.apache.tools.ant.taskdefs.Get.execute(Get.java:76)
        at org.apache.tools.ant.UnknownElement.execute(UnknownElement.java:275)
        at org.apache.tools.ant.Task.perform(Task.java:364)
        at org.apache.tools.ant.Target.execute(Target.java:341)
        at org.apache.tools.ant.Target.performTasks(Target.java:369)
        at org.apache.tools.ant.Project.executeSortedTargets(Project.java:1216)
        at
org.apache.tools.ant.helper.SingleCheckExecutor.executeTargets(SingleCheckExecutor.java:37)
        at org.apache.tools.ant.Project.executeTargets(Project.java:1068)
        at org.apache.tools.ant.taskdefs.Ant.execute(Ant.java:382)
        at org.apache.tools.ant.taskdefs.CallTarget.execute(CallTarget.java:107)
        at org.apache.tools.ant.UnknownElement.execute(UnknownElement.java:275)
        at org.apache.tools.ant.Task.perform(Task.java:364)
        at org.apache.tools.ant.Target.execute(Target.java:341)
        at org.apache.tools.ant.Target.performTasks(Target.java:369)
        at org.apache.tools.ant.Project.executeSortedTargets(Project.java:1216)
        at org.apache.tools.ant.Project.executeTarget(Project.java:1185)
        at
org.apache.tools.ant.helper.DefaultExecutor.executeTargets(DefaultExecutor.java:40)
        at org.apache.tools.ant.Project.executeTargets(Project.java:1068)
        at org.apache.tools.ant.Main.runBuild(Main.java:668)
        at org.apache.tools.ant.Main.startAnt(Main.java:187)
        at org.apache.tools.ant.launch.Launcher.run(Launcher.java:246)
        at org.apache.tools.ant.launch.Launcher.main(Launcher.java:67)

Same for Linux/PC.

-- 
Configure bugmail: http://issues.apache.org/bugzilla/userprefs.cgi?tab=email
------- You are receiving this mail because: -------
You are the assignee for the bug, or are watching the assignee.

---------------------------------------------------------------------
To unsubscribe, e-mail: dev-unsubscribe@ant.apache.org
For additional commands, e-mail: dev-help@ant.apache.org


Mime
View raw message