ant-dev mailing list archives

Site index · List index
Message view « Date » · « Thread »
Top « Date » · « Thread »
From Jan.Mate...@rzf.fin-nrw.de
Subject AW: [GUMP@brutus]: Project test-ant (in module ant) failed
Date Thu, 28 Oct 2004 09:39:00 GMT
If my script fetched the right ...

Jan


Testcase:
testCompilerArgForForkAndExtJavac(org.apache.tools.ant.taskdefs.JavacTest):
FAILED
both are forked javac expected:<1> but was:<0>
junit.framework.AssertionFailedError: both are forked javac
expected:<1> but was:<0>
	at junit.framework.Assert.fail(Assert.java:47)
	at junit.framework.Assert.failNotEquals(Assert.java:280)
	at junit.framework.Assert.assertEquals(Assert.java:64)
	at junit.framework.Assert.assertEquals(Assert.java:198)
	at
org.apache.tools.ant.taskdefs.JavacTest.testCompilerArgForForkAndExtJavac(Ja
vacTest.java:136)



Testcase: testCompilerAttribute(org.apache.tools.ant.taskdefs.JavacTest):
FAILED
expected:<[extJavac]> but was:<[javac1.4]>
junit.framework.ComparisonFailure: expected:<[extJavac]> but
was:<[javac1.4]>
	at junit.framework.Assert.assertEquals(Assert.java:81)
	at junit.framework.Assert.assertEquals(Assert.java:87)
	at
org.apache.tools.ant.taskdefs.JavacTest.testCompilerAttribute(JavacTest.java
:157)
	at sun.reflect.NativeMethodAccessorImpl.invoke0(Native Method)
	at
sun.reflect.NativeMethodAccessorImpl.invoke(NativeMethodAccessorImpl.java:39
)



Testcase: testCompilerAdapter(org.apache.tools.ant.taskdefs.JavacTest):
FAILED
null
junit.framework.AssertionFailedError
	at junit.framework.Assert.fail(Assert.java:47)
	at junit.framework.Assert.assertTrue(Assert.java:20)
	at junit.framework.Assert.assertTrue(Assert.java:27)
	at
org.apache.tools.ant.taskdefs.JavacTest.testCompilerAdapter(JavacTest.java:2
10)
	at sun.reflect.NativeMethodAccessorImpl.invoke0(Native Method)



Testcase:
testLocalWsdlServer(org.apache.tools.ant.taskdefs.optional.WsdlToDotnetTest)
:	Caused an ERROR
WSDL returned: 129
/home/gump/workspaces2/public/workspace/ant/src/etc/testcases/taskdefs/optio
nal/WsdlToDotnet.xml:126: WSDL returned: 129
	at
org.apache.tools.ant.taskdefs.optional.dotnet.NetCommand.runCommand(NetComma
nd.java:296)
	at
org.apache.tools.ant.taskdefs.optional.dotnet.WsdlToDotnet.execute(WsdlToDot
net.java:335)
	at
org.apache.tools.ant.UnknownElement.execute(UnknownElement.java:275)
	at sun.reflect.GeneratedMethodAccessor24.invoke(Unknown Source)
	at
sun.reflect.DelegatingMethodAccessorImpl.invoke(DelegatingMethodAccessorImpl
.java:25)



Testcase:
testFunctionalInline(org.apache.tools.ant.taskdefs.optional.repository.GetLi
brariesTest):	Caused an ERROR
maven doesn't denote a Repository
/home/gump/workspaces2/public/workspace/ant/src/etc/testcases/taskdefs/optio
nal/getlibraries.xml:63: maven doesn't denote a Repository
	at
org.apache.tools.ant.types.DataType.getCheckedRef(DataType.java:156)
	at
org.apache.tools.ant.taskdefs.optional.repository.Repository.resolve(Reposit
ory.java:56)
	at
org.apache.tools.ant.taskdefs.optional.repository.GetLibraries.execute(GetLi
braries.java:209)
	at
org.apache.tools.ant.UnknownElement.execute(UnknownElement.java:275)
	at sun.reflect.GeneratedMethodAccessor24.invoke(Unknown Source)



> -----Urspr√ľngliche Nachricht-----
> Von: Gump Integration Build [mailto:general@gump.apache.org]
> Gesendet am: Donnerstag, 28. Oktober 2004 11:31
> An: dev@ant.apache.org
> Betreff: [GUMP@brutus]: Project test-ant (in module ant) failed
> 
> To whom it may engage...
>         
> This is an automated request, but not an unsolicited one. For 
> more information please visit http://gump.apache.org/nagged.html, 
> and/or contact the folk at general@gump.apache.org.
> 
> Project test-ant has an issue affecting its community integration.
> This issue affects 1 projects,
>  and has been outstanding for 6 runs.
> The current state of this project is 'Failed', with reason 
> 'Build Failed'.
> For reference only, the following projects are affected by this:
>     - test-ant :  Java based build tool
> 
> 
> Full details are available at:
>     http://brutus.apache.org/gump/public/ant/test-ant/index.html
> 

Mime
  • Unnamed multipart/alternative (inline, None, 0 bytes)
View raw message