ant-dev mailing list archives

Site index · List index
Message view « Date » · « Thread »
Top « Date » · « Thread »
From Jan.Mate...@rzf.fin-nrw.de
Subject RE: [GUMP@lsd]: ant/test-ant failed
Date Fri, 27 Feb 2004 08:03:22 GMT
http://lsd.student.utwente.nl/gump/ant/gump_work/build_ant_test-ant.html

Testcase:
testGetCommandline(org.apache.tools.ant.types.CommandlineJavaTest):
FAILED
no classpath expected:<4> but was:<58>
junit.framework.AssertionFailedError: no classpath expected:<4> but was:<58>
	at junit.framework.Assert.fail(Assert.java:47)
 	at junit.framework.Assert.failNotEquals(Assert.java:283)
	at junit.framework.Assert.assertEquals(Assert.java:64)
	at junit.framework.Assert.assertEquals(Assert.java:201)
	at
org.apache.tools.ant.types.CommandlineJavaTest.testGetCommandlineCommandline
JavaTest.java:52)


Testcase: testJarOption(org.apache.tools.ant.types.CommandlineJavaTest):
FAILED
expected:<...jar> but was:<...Djava.runtime.name=Java(TM) 2 Runtime
Environment, Standard Edition>
junit.framework.ComparisonFailure: expected:<...jar> but
was:<...Djava.runtime.name=Java(TM) 2 Runtime Environment, Standard Edition>
	at junit.framework.Assert.assertEquals(Assert.java:81)
	at junit.framework.Assert.assertEquals(Assert.java:87)
	at
org.apache.tools.ant.types.CommandlineJavaTest.testJarOption(CommandlineJava
Test.java:96)
    

But it seems that they´ve changed the configuration regarding JDK.


[junit] Testsuite:
org.apache.tools.ant.taskdefs.optional.sitraka.ClassPathLoaderTest
    [junit] Tests run: 1, Failures: 0, Errors: 0, Time elapsed: 5.346 sec

    [junit] ------------- Standard Output ---------------
    [junit] Processing /usr/java/j2sdk1.4.2/jre/lib/rt.jar
    [junit] 9204 classes loaded in 5096ms
    [junit] Processing /usr/java/j2sdk1.4.2/jre/lib/jce.jar
    [junit] 60 classes loaded in 50ms
    [junit] Processing /usr/java/j2sdk1.4.2/jre/lib/jsse.jar
    [junit] 380 classes loaded in 160ms
    [junit] ------------- ---------------- ---------------
    [junit] ------------- Standard Error -----------------
    [junit] dropping /usr/java/j2sdk1.4.2/jre/jre/lib/rt.jar from path as it
doesn't exist
    [junit] dropping /usr/java/j2sdk1.4.2/jre/../Classes/jce.jar from path
as it doesn't exist
    [junit] dropping /usr/java/j2sdk1.4.2/jre/../Classes/jsse.jar from path
as it doesn't exist
    [junit] dropping /usr/java/j2sdk1.4.2/jre/lib/core.jar from path as it
doesn't exist
    [junit] dropping /usr/java/j2sdk1.4.2/jre/lib/graphics.jar from path as
it doesn't exist
    [junit] dropping /usr/java/j2sdk1.4.2/jre/lib/security.jar from path as
it doesn't exist
    [junit] dropping /usr/java/j2sdk1.4.2/jre/lib/server.jar from path as it
doesn't exist
    [junit] dropping /usr/java/j2sdk1.4.2/jre/lib/xml.jar from path as it
doesn't exist
    [junit] dropping /usr/java/j2sdk1.4.2/jre/../Classes/classes.jar from
path as it doesn't exist
    [junit] dropping /usr/java/j2sdk1.4.2/jre/../Classes/ui.jar from path as
it doesn't exist
    [junit] ------------- ---------------- ---------------

    [junit] Testsuite: org.apache.tools.ant.taskdefs.optional.sos.SOSTest
    [junit] Tests run: 11, Failures: 0, Errors: 0, Time elapsed: 0.154 sec



On section "Environment Overrides" the CLASSPATH starts with
":/usr/java/j2sdk1.4.2//lib/tools.jar ".
I´m not sure whether the ":" and the "//" are correct ...




Jan






> -----Original Message-----
> From: Gump Integration Build [mailto:dev@ant.apache.org]
> Sent: Friday, February 27, 2004 6:52 AM
> To: dev@ant.apache.org
> Subject: [GUMP@lsd]: ant/test-ant failed
> 
> 
> To whom it may engage...
>         
> This is an automated request, but not an unsolicited one. For 
> help understanding the request please visit 
> http://jakarta.apache.org/gump/nagged.html, and/or contact 
> gump@jakarta.apache.org.
> 
> Project test-ant has an issue affecting it's community 
> integration, and has been outstanding for 8 runs. The current 
> state is 'Failed', for reason 'Build Failed'
> 
> Full details are available at: 
> http://lsd.student.utwente.nl/gump/ant/test-ant.html, however 
> some snippets follow:
> 
> -  -  -  -  - -- -- ------------------------------------ G U M P
> 
> Gump provided these annotations:
> 
>  - Error - Failed with reason build failed
> 
> 
> -  -  -  -  - -- -- ------------------------------------ G U M P
> Gump performed this work:
> 
> Work Name: build_ant_test-ant (Type: Build)
> State: Failed
> Elapsed: 0 hours, 6 minutes, 19 seconds
> Command Line: java -Djava.awt.headless=true 
> -Dbuild.clonevm=true 
> -Xbootclasspath/p:/data3/gump/xml-xerces2/java/build/xercesImp
> l.jar:/data3/gump/xml-xerces2/java/build/xmlParserAPIs.jar:/da
> ta3/gump/xml-commons/java/external/build/xml-apis.jar:/data3/g
> ump/xml-xalan/java/build/xalan-unbundled.jar 
> org.apache.tools.ant.Main 
> -Dgump.merge=/data3/gump/gump/work/merge.xml 
> -Dbuild.sysclasspath=only -Dtest.haltonfailure=false 
> -Dant.home=/data3/gump/ant/dist -Dhave.cvs=true run-tests 
> [Working Directory: /data3/gump/ant]
> ---------------------------------------------
> 
>     [junit] Testsuite: 
> org.apache.tools.ant.util.regexp.JakartaRegexpRegexpTest
>     [junit] Tests run: 15, Failures: 0, Errors: 0, Time 
> elapsed: 0.046 sec
> 
> 
>     [junit] Testsuite: 
> org.apache.tools.ant.util.regexp.Jdk14RegexpMatcherTest
>     [junit] Tests run: 12, Failures: 0, Errors: 0, Time 
> elapsed: 0.007 sec
> 
> 
>     [junit] Testsuite: 
> org.apache.tools.ant.util.regexp.Jdk14RegexpRegexpTest
>     [junit] Tests run: 15, Failures: 0, Errors: 0, Time 
> elapsed: 0.007 sec
> 
> 
>     [junit] Testsuite: org.apache.tools.mail.MailMessageTest
>     [junit] Tests run: 7, Failures: 0, Errors: 0, Time 
> elapsed: 0.363 sec
> 
> 
>     [junit] Testsuite: org.apache.tools.tar.TarEntryTest
>     [junit] Tests run: 1, Failures: 0, Errors: 0, Time 
> elapsed: 0.011 sec
> 
> 
>     [junit] Testsuite: org.apache.tools.tar.TarRoundTripTest
>     [junit] Tests run: 1, Failures: 0, Errors: 0, Time 
> elapsed: 0.031 sec
> 
> 
>     [junit] Testsuite: org.apache.tools.zip.AsiExtraFieldTest
>     [junit] Tests run: 3, Failures: 0, Errors: 0, Time 
> elapsed: 0.016 sec
> 
> 
>     [junit] Testsuite: org.apache.tools.zip.ExtraFieldUtilsTest
>     [junit] Tests run: 2, Failures: 0, Errors: 0, Time 
> elapsed: 0.025 sec
> 
> 
>     [junit] Testsuite: org.apache.tools.zip.ZipEntryTest
>     [junit] Tests run: 2, Failures: 0, Errors: 0, Time 
> elapsed: 0.027 sec
> 
> 
>     [junit] Testsuite: org.apache.tools.zip.ZipLongTest
>     [junit] Tests run: 4, Failures: 0, Errors: 0, Time 
> elapsed: 0.005 sec
> 
> 
>     [junit] Testsuite: org.apache.tools.zip.ZipShortTest
>     [junit] Tests run: 4, Failures: 0, Errors: 0, Time 
> elapsed: 0.005 sec
> 
> 
> 
> BUILD FAILED
> /data3/gump/ant/build.xml:1572: At least one test has failed.
> 
> Total time: 6 minutes 17 seconds
> ---------------------------------------------
> 
> 
> 
> 
> To subscribe to this information via syndicated feeds:
> RSS: http://lsd.student.utwente.nl/gump/ant/test-ant.rss | 
> Atom: http://lsd.student.utwente.nl/gump/ant/test-ant.atom
> 
> --
> Gump http://jakarta.apache.org/gump
> [lsd]
> 
> ---------------------------------------------------------------------
> To unsubscribe, e-mail: dev-unsubscribe@ant.apache.org
> For additional commands, e-mail: dev-help@ant.apache.org
> 

Mime
  • Unnamed multipart/alternative (inline, None, 0 bytes)
View raw message