ant-dev mailing list archives

Site index · List index
Message view « Date » · « Thread »
Top « Date » · « Thread »
From Jan.Mate...@rzf.fin-nrw.de
Subject oata.ExecuteOnTest fails (Redirector)
Date Wed, 18 Feb 2004 06:45:23 GMT
On my machine (W2K, JDK 1.4.2) the ExecuteOnTest fails.
Are you working on that, Matt?


Jan



[junit] Testsuite: org.apache.tools.ant.taskdefs.ExecuteOnTest
[junit] Tests run: 8, Failures: 4, Errors: 4, Time elapsed: 0,581 sec

[junit] Testcase:
testNoRedirect(org.apache.tools.ant.taskdefs.ExecuteOnTest):      FAILED
[junit] xout < 0
[junit] junit.framework.AssertionFailedError: xout < 0
[junit]     at junit.framework.Assert.fail(Assert.java:47)
[junit]     at junit.framework.Assert.assertTrue(Assert.java:20)
[junit]     at junit.framework.Assert.assertFalse(Assert.java:34)
[junit]     at
org.apache.tools.ant.taskdefs.ExecuteOnTest.testNoRedirect(ExecuteOnTest.jav
a:62)

[junit] Testcase:
testRedirect1(org.apache.tools.ant.taskdefs.ExecuteOnTest):       Caused an
ERROR
[junit] null
[junit] java.lang.NullPointerException
[junit]     at
org.apache.tools.ant.taskdefs.ExecuteOnTest.testRedirect1(ExecuteOnTest.java
:85)

[junit] Testcase:
testRedirect2(org.apache.tools.ant.taskdefs.ExecuteOnTest):       Caused an
ERROR
[junit] null
[junit] java.lang.NullPointerException
[junit]     at
org.apache.tools.ant.taskdefs.ExecuteOnTest.testRedirect2(ExecuteOnTest.java
:117)

[junit] Testcase:
testRedirect3(org.apache.tools.ant.taskdefs.ExecuteOnTest):       Caused an
ERROR
[junit] null
[junit] java.lang.NullPointerException
[junit]     at
org.apache.tools.ant.taskdefs.ExecuteOnTest.testRedirect3(ExecuteOnTest.java
:146)

[junit] Testcase:
testRedirect4(org.apache.tools.ant.taskdefs.ExecuteOnTest):       Caused an
ERROR
[junit] null
[junit] java.lang.NullPointerException
[junit]     at
org.apache.tools.ant.taskdefs.ExecuteOnTest.testRedirect4(ExecuteOnTest.java
:179)

[junit] Testcase:
testRedirect5(org.apache.tools.ant.taskdefs.ExecuteOnTest):       FAILED
[junit] property redirect.out expected:<blah y z> but was:<null>
[junit] junit.framework.ComparisonFailure: property redirect.out
expected:<blah y z> but was:<null>
[junit]     at junit.framework.Assert.assertEquals(Assert.java:81)
[junit]     at
org.apache.tools.ant.BuildFileTest.assertPropertyEquals(BuildFileTest.java:3
22)
[junit]     at
org.apache.tools.ant.taskdefs.ExecuteOnTest.testRedirect5or6(ExecuteOnTest.j
ava:218)
[junit]     at
org.apache.tools.ant.taskdefs.ExecuteOnTest.testRedirect5(ExecuteOnTest.java
:200)

[junit] Testcase:
testRedirect6(org.apache.tools.ant.taskdefs.ExecuteOnTest):       FAILED
[junit] property redirect.out expected:<blah y z> but was:<null>
[junit] junit.framework.ComparisonFailure: property redirect.out
expected:<blah y z> but was:<null>
[junit]     at junit.framework.Assert.assertEquals(Assert.java:81)
[junit]     at
org.apache.tools.ant.BuildFileTest.assertPropertyEquals(BuildFileTest.java:3
22)
[junit]     at
org.apache.tools.ant.taskdefs.ExecuteOnTest.testRedirect5or6(ExecuteOnTest.j
ava:218)
[junit]     at
org.apache.tools.ant.taskdefs.ExecuteOnTest.testRedirect6(ExecuteOnTest.java
:204)

[junit] Testcase:
testRedirect7(org.apache.tools.ant.taskdefs.ExecuteOnTest):       FAILED
[junit] property redirect.out expected:<blah y z> but was:<null>
[junit] junit.framework.ComparisonFailure: property redirect.out
expected:<blah y z> but was:<null>
[junit]     at junit.framework.Assert.assertEquals(Assert.java:81)
[junit]     at
org.apache.tools.ant.BuildFileTest.assertPropertyEquals(BuildFileTest.java:3
22)
[junit]     at
org.apache.tools.ant.taskdefs.ExecuteOnTest.testRedirect7(ExecuteOnTest.java
:236)


---------------------------------------------------------------------
To unsubscribe, e-mail: dev-unsubscribe@ant.apache.org
For additional commands, e-mail: dev-help@ant.apache.org


Mime
View raw message