ant-dev mailing list archives

Site index · List index
Message view « Date » · « Thread »
Top « Date » · « Thread »
From Jan.Mate...@rzf.fin-nrw.de
Subject RE: [GUMP@lsd]: ant/test-ant failed
Date Tue, 10 Feb 2004 09:27:14 GMT
http://lsd.student.utwente.nl/gump/ant/work/build_ant_test-ant.html

[junit] Testsuite: org.apache.tools.ant.taskdefs.JarTest
[junit] Tests run: 23, Failures: 1, Errors: 0, Time elapsed: 40.177 sec

[junit] Testcase:
testRecreateWithUpdateNewerFile(org.apache.tools.ant.taskdefs.JarTest):
FAILED
[junit] jar has been recreated in testRecreateWithUpdateNewerFile
[junit] junit.framework.AssertionFailedError: jar has been recreated in
testRecreateWithUpdateNewerFile
[junit] 	at junit.framework.Assert.fail(Assert.java:47)
[junit] 	at junit.framework.Assert.assertTrue(Assert.java:20)
[junit] 	at
org.apache.tools.ant.taskdefs.JarTest.testRecreate(JarTest.java:139)
[junit] 	at
org.apache.tools.ant.taskdefs.JarTest.testRecreateWithUpdateNewerFile(JarTes
t.java:121)

[junit] TEST org.apache.tools.ant.taskdefs.JarTest FAILED
        




> -----Original Message-----
> From: Gump Integration Build [mailto:dev@ant.apache.org]
> Sent: Tuesday, February 10, 2004 11:12 AM
> To: dev@ant.apache.org
> Subject: [GUMP@lsd]: ant/test-ant failed
> 
> 
> Project: test-ant
> State: Failed
> URL: http://lsd.student.utwente.nl/gump/ant/test-ant.html
> ------------------------------------------------- G U M P Y
> 
> 
> Annotations:
>  - Error - Failed with reason build failed
> 
> 
> ------------------------------------------------- G U M P Y
> Work Name: build_ant_test-ant (Type: Build)
> State: Failed
> Elapsed: 0 hours, 5 minutes, 44 seconds
> Command Line: java -Djava.awt.headless=true 
> -Xbootclasspath/p:/data/gump/xml-xerces2/java/build/xercesImpl
> .jar:/data/gump/xml-xerces2/java/build/xmlParserAPIs.jar:/data
> /gump/xml-commons/java/external/build/xml-apis.jar:/data/gump/
> xml-xalan/java/build/xalan-unbundled.jar 
> org.apache.tools.ant.Main -Dbuild.clonevm=true 
> -Dgump.merge=/data/gump/gump/work/merge.xml 
> -Dbuild.sysclasspath=only -Dtest.haltonfailure=false 
> -Dant.home=/data/gump/ant/dist -Dhave.cvs=true run-tests 
> [Working Directory: /data/gump/ant]
> ---------------------------------------------
> 
>     [junit] Testsuite: 
> org.apache.tools.ant.util.regexp.JakartaRegexpRegexpTest
>     [junit] Tests run: 15, Failures: 0, Errors: 0, Time 
> elapsed: 0.054 sec
> 
> 
>     [junit] Testsuite: 
> org.apache.tools.ant.util.regexp.Jdk14RegexpMatcherTest
>     [junit] Tests run: 12, Failures: 0, Errors: 0, Time 
> elapsed: 0.006 sec
> 
> 
>     [junit] Testsuite: 
> org.apache.tools.ant.util.regexp.Jdk14RegexpRegexpTest
>     [junit] Tests run: 15, Failures: 0, Errors: 0, Time 
> elapsed: 0.007 sec
> 
> 
>     [junit] Testsuite: org.apache.tools.mail.MailMessageTest
>     [junit] Tests run: 7, Failures: 0, Errors: 0, Time 
> elapsed: 0.364 sec
> 
> 
>     [junit] Testsuite: org.apache.tools.tar.TarEntryTest
>     [junit] Tests run: 1, Failures: 0, Errors: 0, Time 
> elapsed: 0.011 sec
> 
> 
>     [junit] Testsuite: org.apache.tools.tar.TarRoundTripTest
>     [junit] Tests run: 1, Failures: 0, Errors: 0, Time 
> elapsed: 0.037 sec
> 
> 
>     [junit] Testsuite: org.apache.tools.zip.AsiExtraFieldTest
>     [junit] Tests run: 3, Failures: 0, Errors: 0, Time 
> elapsed: 0.016 sec
> 
> 
>     [junit] Testsuite: org.apache.tools.zip.ExtraFieldUtilsTest
>     [junit] Tests run: 2, Failures: 0, Errors: 0, Time 
> elapsed: 0.025 sec
> 
> 
>     [junit] Testsuite: org.apache.tools.zip.ZipEntryTest
>     [junit] Tests run: 2, Failures: 0, Errors: 0, Time 
> elapsed: 0.027 sec
> 
> 
>     [junit] Testsuite: org.apache.tools.zip.ZipLongTest
>     [junit] Tests run: 4, Failures: 0, Errors: 0, Time 
> elapsed: 0.005 sec
> 
> 
>     [junit] Testsuite: org.apache.tools.zip.ZipShortTest
>     [junit] Tests run: 4, Failures: 0, Errors: 0, Time 
> elapsed: 0.005 sec
> 
> 
> 
> BUILD FAILED
> /data/gump/ant/build.xml:1565: At least one test has failed.
> 
> Total time: 5 minutes 42 seconds
> ---------------------------------------------
> 
> ------------------------------------------------- G U M P Y
> RSS: http://lsd.student.utwente.nl/gump/ant/test-ant.rss | 
> Atom: http://lsd.student.utwente.nl/gump/ant/test-ant.atom
> 
> --
> Gump http://jakarta.apache.org/gump
> [lsd]
> 
> ---------------------------------------------------------------------
> To unsubscribe, e-mail: dev-unsubscribe@ant.apache.org
> For additional commands, e-mail: dev-help@ant.apache.org
> 

Mime
  • Unnamed multipart/alternative (inline, None, 0 bytes)
View raw message