ant-dev mailing list archives

Site index · List index
Message view « Date » · « Thread »
Top « Date » · « Thread »
From bugzi...@apache.org
Subject DO NOT REPLY [Bug 17402] New: - FixCrLfTest & CommandlineJavaTest are failing in src release
Date Tue, 25 Feb 2003 22:22:25 GMT
DO NOT REPLY TO THIS EMAIL, BUT PLEASE POST YOUR BUG 
RELATED COMMENTS THROUGH THE WEB INTERFACE AVAILABLE AT
<http://nagoya.apache.org/bugzilla/show_bug.cgi?id=17402>.
ANY REPLY MADE TO THIS MESSAGE WILL NOT BE COLLECTED AND 
INSERTED IN THE BUG DATABASE.

http://nagoya.apache.org/bugzilla/show_bug.cgi?id=17402

FixCrLfTest & CommandlineJavaTest are failing in src release

           Summary: FixCrLfTest & CommandlineJavaTest are failing in src
                    release
           Product: Ant
           Version: 1.5.1
          Platform: PC
        OS/Version: Windows NT/2K
            Status: NEW
          Severity: Minor
          Priority: Other
         Component: Other
        AssignedTo: dev@ant.apache.org
        ReportedBy: agoodno@yahoo.com


*FixCrLfTest*


    [junit] Testsuite: org.apache.tools.ant.taskdefs.FixCrLfTest
    [junit] Tests run: 3, Failures: 1, Errors: 0, Time elapsed: 0.11 sec

    [junit] Testcase: test3(org.apache.tools.ant.taskdefs.FixCrLfTest): FAILED
    [junit] expected:<13> but was:<10>
    [junit] junit.framework.AssertionFailedError: expected:<13> but was:<10>
    [junit]     at junit.framework.Assert.fail(Assert.java:47)
    [junit]     at junit.framework.Assert.failNotEquals(Assert.java:282)
    [junit]     at junit.framework.Assert.assertEquals(Assert.java:64)
    [junit]     at junit.framework.Assert.assertEquals(Assert.java:201)
    [junit]     at junit.framework.Assert.assertEquals(Assert.java:207)
    [junit]     at
org.apache.tools.ant.taskdefs.FixCrLfTest.assertEqualContent(FixCrLfTest.java:201)
    [junit]     at
org.apache.tools.ant.taskdefs.FixCrLfTest.test3(FixCrLfTest.java:96)
    [junit]     at sun.reflect.NativeMethodAccessorImpl.invoke0(Native Method)
    [junit]     at
sun.reflect.NativeMethodAccessorImpl.invoke(NativeMethodAccessorImpl.java:39)
    [junit]     at
sun.reflect.DelegatingMethodAccessorImpl.invoke(DelegatingMethodAccessorImpl.java:25)
    [junit]     at java.lang.reflect.Method.invoke(Method.java:324)
    [junit]     at junit.framework.TestCase.runTest(TestCase.java:154)
    [junit]     at junit.framework.TestCase.runBare(TestCase.java:127)
    [junit]     at junit.framework.TestResult$1.protect(TestResult.java:106)
    [junit]     at junit.framework.TestResult.runProtected(TestResult.java:124)
    [junit]     at junit.framework.TestResult.run(TestResult.java:109)
    [junit]     at junit.framework.TestCase.run(TestCase.java:118)
    [junit]     at junit.framework.TestSuite.runTest(TestSuite.java:208)
    [junit]     at junit.framework.TestSuite.run(TestSuite.java:203)
    [junit]     at
org.apache.tools.ant.taskdefs.optional.junit.JUnitTestRunner.run(JUnitTestRunner.java:325)
    [junit]     at
org.apache.tools.ant.taskdefs.optional.junit.JUnitTask.executeInVM(JUnitTask.java:804)
    [junit]     at
org.apache.tools.ant.taskdefs.optional.junit.JUnitTask.execute(JUnitTask.java:551)
    [junit]     at
org.apache.tools.ant.taskdefs.optional.junit.JUnitTask.execute(JUnitTask.java:527)
    [junit]     at org.apache.tools.ant.Task.perform(Task.java:319)
    [junit]     at org.apache.tools.ant.Target.execute(Target.java:309)
    [junit]     at org.apache.tools.ant.Target.performTasks(Target.java:336)
    [junit]     at org.apache.tools.ant.Project.executeTarget(Project.java:1306)
    [junit]     at org.apache.tools.ant.Project.executeTargets(Project.java:1250)
    [junit]     at org.apache.tools.ant.Main.runBuild(Main.java:610)
    [junit]     at org.apache.tools.ant.Main.start(Main.java:196)
    [junit]     at org.apache.tools.ant.Main.main(Main.java:235)



BUILD FAILED
file:D:/Dev/Tools/jakarta-ant-1.5.1/build.xml:1248: Test
org.apache.tools.ant.taskdefs.FixCrLfTest failed




*CommandlineJavaTest*


    [junit] Testsuite: org.apache.tools.ant.types.CommandlineJavaTest
    [junit] Tests run: 1, Failures: 1, Errors: 0, Time elapsed: 0.015 sec

    [junit] Testcase:
testGetCommandline(org.apache.tools.ant.types.CommandlineJavaTest):       FAILED
    [junit] junit.jar contained
    [junit] junit.framework.AssertionFailedError: junit.jar contained
    [junit]     at junit.framework.Assert.fail(Assert.java:47)
    [junit]     at junit.framework.Assert.assertTrue(Assert.java:20)
    [junit]     at
org.apache.tools.ant.types.CommandlineJavaTest.testGetCommandline(CommandlineJavaTest.java:115)
    [junit]     at sun.reflect.NativeMethodAccessorImpl.invoke0(Native Method)
    [junit]     at
sun.reflect.NativeMethodAccessorImpl.invoke(NativeMethodAccessorImpl.java:39)
    [junit]     at
sun.reflect.DelegatingMethodAccessorImpl.invoke(DelegatingMethodAccessorImpl.java:25)
    [junit]     at java.lang.reflect.Method.invoke(Method.java:324)
    [junit]     at junit.framework.TestCase.runTest(TestCase.java:154)
    [junit]     at junit.framework.TestCase.runBare(TestCase.java:127)
    [junit]     at junit.framework.TestResult$1.protect(TestResult.java:106)
    [junit]     at junit.framework.TestResult.runProtected(TestResult.java:124)
    [junit]     at junit.framework.TestResult.run(TestResult.java:109)
    [junit]     at junit.framework.TestCase.run(TestCase.java:118)
    [junit]     at junit.framework.TestSuite.runTest(TestSuite.java:208)
    [junit]     at junit.framework.TestSuite.run(TestSuite.java:203)
    [junit]     at
org.apache.tools.ant.taskdefs.optional.junit.JUnitTestRunner.run(JUnitTestRunner.java:325)
    [junit]     at
org.apache.tools.ant.taskdefs.optional.junit.JUnitTask.executeInVM(JUnitTask.java:804)
    [junit]     at
org.apache.tools.ant.taskdefs.optional.junit.JUnitTask.execute(JUnitTask.java:551)
    [junit]     at
org.apache.tools.ant.taskdefs.optional.junit.JUnitTask.execute(JUnitTask.java:527)
    [junit]     at org.apache.tools.ant.Task.perform(Task.java:319)
    [junit]     at org.apache.tools.ant.Target.execute(Target.java:309)
    [junit]     at org.apache.tools.ant.Target.performTasks(Target.java:336)
    [junit]     at org.apache.tools.ant.Project.executeTarget(Project.java:1306)
    [junit]     at org.apache.tools.ant.Project.executeTargets(Project.java:1250)
    [junit]     at org.apache.tools.ant.Main.runBuild(Main.java:610)
    [junit]     at org.apache.tools.ant.Main.start(Main.java:196)
    [junit]     at org.apache.tools.ant.Main.main(Main.java:235)



BUILD FAILED
file:D:/Dev/Tools/jakarta-ant-1.5.1/build.xml:1248: Test
org.apache.tools.ant.types.CommandlineJavaTest failed

Mime
View raw message